BDBM210641 US9290451, 316
SMILES: CCC(CC)(NC(=O)c1ccc(c(OCC2CC2)n1)C(F)(F)F)C(=O)N1CC(F)(F)C1
InChI Key: InChIKey=WNXURRIGAZXRQR-UHFFFAOYSA-N
Data: 2 EC50
Activity Spreadsheet -- Enzyme Inhibition Constant Data from BindingDB
Found 2 hits for monomerid = 210641
Trg + Lig
Ki
nM
ΔG°
kcal/mole
IC50
nM
Kd
nM
EC50/IC50
nM
koff
s-1
kon
M-1s-1
pHTemp
°C
Cannabinoid receptor 1
(Homo sapiens (Human))
BDBM210641
(US9290451, 316)
Show SMILES CCC(CC)(NC(=O)c1ccc(c(OCC2CC2)n1)C(F)(F)F)C(=O)N1CC(F)(F)C1
Show InChI InChI=1S/C20H24F5N3O3/c1-3-18(4-2,17(30)28-10-19(21,22)11-28)27-15(29)14-8-7-13(20(23,24)25)16(26-14)31-9-12-5-6-12/h7-8,12H,3-6,9-11H2,1-2H3,(H,27,29)
NCI pathway
Reactome pathway
US Patent
n/an/an/an/a>1.00E+4n/an/an/a37
Hoffmann-La Roche Inc.
US Patent
Assay Description
CHO cells expressing human CB1 or CB2 receptors are seeded 17-24 hours prior to the experiment 50.000 cells per well in a black 96 well plate with fl...
US Patent US9290451 (2016)
BindingDB Entry DOI: 10.7270/Q20Z724J
Cannabinoid receptor 2
(Homo sapiens (Human))
BDBM210641
(US9290451, 316)
Show SMILES CCC(CC)(NC(=O)c1ccc(c(OCC2CC2)n1)C(F)(F)F)C(=O)N1CC(F)(F)C1
Show InChI InChI=1S/C20H24F5N3O3/c1-3-18(4-2,17(30)28-10-19(21,22)11-28)27-15(29)14-8-7-13(20(23,24)25)16(26-14)31-9-12-5-6-12/h7-8,12H,3-6,9-11H2,1-2H3,(H,27,29)
Reactome pathway
US Patent
n/an/an/an/a 3.10n/an/an/a37
Hoffmann-La Roche Inc.
US Patent
Assay Description
CHO cells expressing human CB1 or CB2 receptors are seeded 17-24 hours prior to the experiment 50.000 cells per well in a black 96 well plate with fl...
US Patent US9290451 (2016)
BindingDB Entry DOI: 10.7270/Q20Z724J