BDBM21078 3-[4-(3-amino-1,2-benzothiazol-4-yl)phenyl]-1-[3-(trifluoromethyl)phenyl]urea::Aminobenzoisothiazole, 19
SMILES: Nc1nsc2cccc(-c3ccc(NC(=O)Nc4cccc(c4)C(F)(F)F)cc3)c12
InChI Key: InChIKey=UKUBGLJCBLBBTL-UHFFFAOYSA-N
Data: 3 IC50
Activity Spreadsheet -- Enzyme Inhibition Constant Data from BindingDB
Found 3 hits for monomerid = 21078
Trg + Lig
Ki
nM
ΔG°
kcal/mole
IC50
nM
Kd
nM
EC50/IC50
nM
koff
s-1
kon
M-1s-1
pHTemp
°C
Mast/stem cell growth factor receptor Kit
(Homo sapiens (Human))
BDBM21078
(3-[4-(3-amino-1,2-benzothiazol-4-yl)phenyl]-1-[3-(...)
Show SMILES Nc1nsc2cccc(-c3ccc(NC(=O)Nc4cccc(c4)C(F)(F)F)cc3)c12
Show InChI InChI=1S/C21H15F3N4OS/c22-21(23,24)13-3-1-4-15(11-13)27-20(29)26-14-9-7-12(8-10-14)16-5-2-6-17-18(16)19(25)28-30-17/h1-11H,(H2,25,28)(H2,26,27,29)
n/an/a 2.63E+3n/an/an/an/an/an/a
Abbott Laboratories
Assay Description
The assay uses purified enzyme interacting with biotinylated peptide substrate. HTRF is based on the proximity of europium cryptate (donor fluorophor...
J Med Chem 51: 1231-41 (2008)
Article DOI: 10.1021/jm701096v
BindingDB Entry DOI: 10.7270/Q2HX19Z7
Vascular endothelial growth factor receptor 2
(Homo sapiens (Human))
BDBM21078
(3-[4-(3-amino-1,2-benzothiazol-4-yl)phenyl]-1-[3-(...)
Show SMILES Nc1nsc2cccc(-c3ccc(NC(=O)Nc4cccc(c4)C(F)(F)F)cc3)c12
Show InChI InChI=1S/C21H15F3N4OS/c22-21(23,24)13-3-1-4-15(11-13)27-20(29)26-14-9-7-12(8-10-14)16-5-2-6-17-18(16)19(25)28-30-17/h1-11H,(H2,25,28)(H2,26,27,29)
NCI pathway
Reactome pathway
n/an/a 247n/an/an/an/a7.522
Abbott Laboratories
Assay Description
The assay uses purified enzyme interacting with biotinylated peptide substrate. HTRF is based on the proximity of europium cryptate (donor fluorophor...
J Med Chem 51: 1231-41 (2008)
Article DOI: 10.1021/jm701096v
BindingDB Entry DOI: 10.7270/Q2HX19Z7
Cytochrome P450 19A1
(Homo sapiens (Human))
BDBM21078
(3-[4-(3-amino-1,2-benzothiazol-4-yl)phenyl]-1-[3-(...)
Show SMILES Nc1nsc2cccc(-c3ccc(NC(=O)Nc4cccc(c4)C(F)(F)F)cc3)c12
Show InChI InChI=1S/C21H15F3N4OS/c22-21(23,24)13-3-1-4-15(11-13)27-20(29)26-14-9-7-12(8-10-14)16-5-2-6-17-18(16)19(25)28-30-17/h1-11H,(H2,25,28)(H2,26,27,29)
Reactome pathway
n/an/a 1.26E+3n/an/an/an/an/an/a
Abbott Laboratories
Assay Description
The assay uses purified enzyme interacting with biotinylated peptide substrate. HTRF is based on the proximity of europium cryptate (donor fluorophor...
J Med Chem 51: 1231-41 (2008)
Article DOI: 10.1021/jm701096v
BindingDB Entry DOI: 10.7270/Q2HX19Z7