BDBM210829 US9290463, B
SMILES: Cn1c(=O)cnn(CCCCN2CCN(CC2)c2cccc(I)n2)c1=O
InChI Key: InChIKey=WSJDMNAJKWFILG-UHFFFAOYSA-N
Data: 1 KI
Activity Spreadsheet -- Enzyme Inhibition Constant Data from BindingDB
Found 1 hit for monomerid = 210829
Trg + Lig
Ki
nM
ΔG°
kcal/mole
IC50
nM
Kd
nM
EC50/IC50
nM
koff
s-1
kon
M-1s-1
pHTemp
°C
5-HT1A/ 5-HT2c
(Homo sapiens (Human))
BDBM210829
(US9290463, B)
Show SMILES Cn1c(=O)cnn(CCCCN2CCN(CC2)c2cccc(I)n2)c1=O
Show InChI InChI=1S/C17H23IN6O2/c1-21-16(25)13-19-24(17(21)26)8-3-2-7-22-9-11-23(12-10-22)15-6-4-5-14(18)20-15/h4-6,13H,2-3,7-12H2,1H3
US Patent
5.5 -10.5n/an/an/an/an/a7.44
The Trustees of Columbia University in the City of New York
US Patent
Assay Description
Preparation of Membrane Fractions from CHO-h5-HT1A Cells. Membranes from CHO cells stably expressing the human 5-HT1A receptor at a density of 8 pmol...
US Patent US9290463 (2016)
BindingDB Entry DOI: 10.7270/Q2MS3RK0