BDBM210877 US9290467, 47
SMILES: CSc1ccc2OC\C=C\COc3ccc(C[C@H](NC(=O)c2c1)C(=O)NC1(CC1)C#N)cc3Cl
InChI Key: InChIKey=WYOBYPKWWFSUMM-NUALSEBGSA-N
Data: 1 IC50
Activity Spreadsheet -- Enzyme Inhibition Constant Data from BindingDB
Found 1 hit for monomerid = 210877
Trg + Lig
Ki
nM
ΔG°
kcal/mole
IC50
nM
Kd
nM
EC50/IC50
nM
koff
s-1
kon
M-1s-1
pHTemp
°C
Procathepsin L
(Homo sapiens (Human))
BDBM210877
(US9290467, 47)
Show SMILES CSc1ccc2OC\C=C\COc3ccc(C[C@H](NC(=O)c2c1)C(=O)NC1(CC1)C#N)cc3Cl |r,t:8|
Show InChI InChI=1S/C25H24ClN3O4S/c1-34-17-5-7-21-18(14-17)23(30)28-20(24(31)29-25(15-27)8-9-25)13-16-4-6-22(19(26)12-16)33-11-3-2-10-32-21/h2-7,12,14,20H,8-11,13H2,1H3,(H,28,30)(H,29,31)/b3-2+/t20-/m0/s1
Reactome pathway
US Patent
n/an/a 1.60n/an/an/an/a6.5n/a
HOFFMANN—LA ROCHE INC.
US Patent
Assay Description
Enzyme activity is measured by observing the increase in fluorescence intensity caused by cleavage of a peptide substrate containing a fluorophore wh...
US Patent US9290467 (2016)
BindingDB Entry DOI: 10.7270/Q2H130VZ