BDBM21107 3-[4-(3-amino-7-methyl-1,2-benzoxazol-4-yl)phenyl]-1-(2-fluoro-5-methylphenyl)urea::Aminobenzoisoxazole, 53
SMILES: Cc1ccc(F)c(NC(=O)Nc2ccc(cc2)-c2ccc(C)c3onc(N)c23)c1
InChI Key: InChIKey=MQVDSHJTABUFES-UHFFFAOYSA-N
Data: 3 IC50  1 EC50
Activity Spreadsheet -- Enzyme Inhibition Constant Data from BindingDB
Found 3 hits for monomerid = 21107
Trg + Lig
Ki
nM
ΔG°
kcal/mole
IC50
nM
Kd
nM
EC50/IC50
nM
koff
s-1
kon
M-1s-1
pHTemp
°C
Mast/stem cell growth factor receptor Kit
(Homo sapiens (Human))
BDBM21107
(3-[4-(3-amino-7-methyl-1,2-benzoxazol-4-yl)phenyl]...)
Show SMILES Cc1ccc(F)c(NC(=O)Nc2ccc(cc2)-c2ccc(C)c3onc(N)c23)c1
Show InChI InChI=1S/C22H19FN4O2/c1-12-3-10-17(23)18(11-12)26-22(28)25-15-7-5-14(6-8-15)16-9-4-13(2)20-19(16)21(24)27-29-20/h3-11H,1-2H3,(H2,24,27)(H2,25,26,28)
n/an/a 64n/an/an/an/an/an/a
Abbott Laboratories
Assay Description
The assay uses purified enzyme interacting with biotinylated peptide substrate. HTRF is based on the proximity of europium cryptate (donor fluorophor...
J Med Chem 51: 1231-41 (2008)
Article DOI: 10.1021/jm701096v
BindingDB Entry DOI: 10.7270/Q2HX19Z7
Vascular endothelial growth factor receptor 2
(Homo sapiens (Human))
BDBM21107
(3-[4-(3-amino-7-methyl-1,2-benzoxazol-4-yl)phenyl]...)
Show SMILES Cc1ccc(F)c(NC(=O)Nc2ccc(cc2)-c2ccc(C)c3onc(N)c23)c1
Show InChI InChI=1S/C22H19FN4O2/c1-12-3-10-17(23)18(11-12)26-22(28)25-15-7-5-14(6-8-15)16-9-4-13(2)20-19(16)21(24)27-29-20/h3-11H,1-2H3,(H2,24,27)(H2,25,26,28)
NCI pathway
Reactome pathway
n/an/a 71n/a 39n/an/an/an/a
Abbott Laboratories
Assay Description
The assay uses purified enzyme interacting with biotinylated peptide substrate. HTRF is based on the proximity of europium cryptate (donor fluorophor...
J Med Chem 51: 1231-41 (2008)
Article DOI: 10.1021/jm701096v
BindingDB Entry DOI: 10.7270/Q2HX19Z7
Cytochrome P450 19A1
(Homo sapiens (Human))
BDBM21107
(3-[4-(3-amino-7-methyl-1,2-benzoxazol-4-yl)phenyl]...)
Show SMILES Cc1ccc(F)c(NC(=O)Nc2ccc(cc2)-c2ccc(C)c3onc(N)c23)c1
Show InChI InChI=1S/C22H19FN4O2/c1-12-3-10-17(23)18(11-12)26-22(28)25-15-7-5-14(6-8-15)16-9-4-13(2)20-19(16)21(24)27-29-20/h3-11H,1-2H3,(H2,24,27)(H2,25,26,28)
Reactome pathway
n/an/a 61n/an/an/an/an/an/a
Abbott Laboratories
Assay Description
The assay uses purified enzyme interacting with biotinylated peptide substrate. HTRF is based on the proximity of europium cryptate (donor fluorophor...
J Med Chem 51: 1231-41 (2008)
Article DOI: 10.1021/jm701096v
BindingDB Entry DOI: 10.7270/Q2HX19Z7