BDBM21168 Imidazole-based ligand, 19::methyl (2S)-2-(benzylamino)-3-(1H-imidazol-4-yl)propanoate
SMILES: COC(=O)[C@H](Cc1cnc[nH]1)NCc1ccccc1
InChI Key: InChIKey=ZVJJJFLRYHVRLN-ZDUSSCGKSA-N
Data: 2 IC50
Activity Spreadsheet -- Enzyme Inhibition Constant Data from BindingDB
Found 2 hits for monomerid = 21168
Trg + Lig
Ki
nM
ΔG°
kcal/mole
IC50
nM
Kd
nM
EC50/IC50
nM
koff
s-1
kon
M-1s-1
pHTemp
°C
Cytochrome P450 2C9
(Homo sapiens (Human))
BDBM21168
(Imidazole-based ligand, 19 | methyl (2S)-2-(benzyl...)
Show SMILES COC(=O)[C@H](Cc1cnc[nH]1)NCc1ccccc1 |r|
Show InChI InChI=1S/C14H17N3O2/c1-19-14(18)13(7-12-9-15-10-17-12)16-8-11-5-3-2-4-6-11/h2-6,9-10,13,16H,7-8H2,1H3,(H,15,17)/t13-/m0/s1
Reactome pathway
n/an/a 2.00E+4n/an/an/an/an/an/a
AstraZeneca
Assay Description
The inhibition of recombinant human CYP2C9 was measured as the ability to perform a demethylation of 7-methoxy-4-trifluoromethylcoumarin (MFC). Befor...
J Med Chem 51: 1755-1763 (2008)
Article DOI: 10.1021/jm701121y
BindingDB Entry DOI: 10.7270/Q20Z71KZ
Cytochrome P450 3A4
(Homo sapiens (Human))
BDBM21168
(Imidazole-based ligand, 19 | methyl (2S)-2-(benzyl...)
Show SMILES COC(=O)[C@H](Cc1cnc[nH]1)NCc1ccccc1 |r|
Show InChI InChI=1S/C14H17N3O2/c1-19-14(18)13(7-12-9-15-10-17-12)16-8-11-5-3-2-4-6-11/h2-6,9-10,13,16H,7-8H2,1H3,(H,15,17)/t13-/m0/s1
Reactome pathway
n/an/a 1.50E+3n/an/an/an/a7.437
AstraZeneca
Assay Description
The inhibition of recombinant human CYP3A4 was measured as the ability to perform a debenzylation of 7-benzyloxy-4-trifluoromethylcoumarin (BFC). Bef...
J Med Chem 51: 1755-1763 (2008)
Article DOI: 10.1021/jm701121y
BindingDB Entry DOI: 10.7270/Q20Z71KZ