BDBM21170 1-[2-(2,4-dichlorophenoxy)-2-(2,4-dichlorophenyl)ethyl]-1H-imidazole::Imidazole-based ligand, 21
SMILES: Clc1ccc(OC(Cn2ccnc2)c2ccc(Cl)cc2Cl)c(Cl)c1
InChI Key: InChIKey=ZSEJKLXYMYILHA-UHFFFAOYSA-N
Data: 2 IC50
Activity Spreadsheet -- Enzyme Inhibition Constant Data from BindingDB
Found 2 hits for monomerid = 21170
Trg + Lig
Ki
nM
ΔG°
kcal/mole
IC50
nM
Kd
nM
EC50/IC50
nM
koff
s-1
kon
M-1s-1
pHTemp
°C
Cytochrome P450 2C9
(Homo sapiens (Human))
BDBM21170
(1-[2-(2,4-dichlorophenoxy)-2-(2,4-dichlorophenyl)e...)
Show SMILES Clc1ccc(OC(Cn2ccnc2)c2ccc(Cl)cc2Cl)c(Cl)c1
Show InChI InChI=1S/C17H12Cl4N2O/c18-11-1-3-13(14(20)7-11)17(9-23-6-5-22-10-23)24-16-4-2-12(19)8-15(16)21/h1-8,10,17H,9H2
Reactome pathway
n/an/a 1.00E+4n/an/an/an/an/an/a
AstraZeneca
Assay Description
The inhibition of recombinant human CYP2C9 was measured as the ability to perform a demethylation of 7-methoxy-4-trifluoromethylcoumarin (MFC). Befor...
J Med Chem 51: 1755-1763 (2008)
Article DOI: 10.1021/jm701121y
BindingDB Entry DOI: 10.7270/Q20Z71KZ
Cytochrome P450 3A4
(Homo sapiens (Human))
BDBM21170
(1-[2-(2,4-dichlorophenoxy)-2-(2,4-dichlorophenyl)e...)
Show SMILES Clc1ccc(OC(Cn2ccnc2)c2ccc(Cl)cc2Cl)c(Cl)c1
Show InChI InChI=1S/C17H12Cl4N2O/c18-11-1-3-13(14(20)7-11)17(9-23-6-5-22-10-23)24-16-4-2-12(19)8-15(16)21/h1-8,10,17H,9H2
Reactome pathway
n/an/a 60n/an/an/an/a7.437
AstraZeneca
Assay Description
The inhibition of recombinant human CYP3A4 was measured as the ability to perform a debenzylation of 7-benzyloxy-4-trifluoromethylcoumarin (BFC). Bef...
J Med Chem 51: 1755-1763 (2008)
Article DOI: 10.1021/jm701121y
BindingDB Entry DOI: 10.7270/Q20Z71KZ