BDBM2121 1-(5-chloropyridin-2-yl)-3-{2-[3-(dimethylamino)-2,6-difluorophenyl]ethyl}thiourea::LY300046HCl Analog 5::N-[2-(2,6-Difluoro-3-(dimethylamino)phenethyl)]-N-[2-(5-chloropyridyl)]thiourea::PETT deriv.
SMILES: CN(C)c1ccc(F)c(CCNC(=S)Nc2ccc(Cl)cn2)c1F
InChI Key: InChIKey=JFMKEUCKWUZCOC-UHFFFAOYSA-N
Data: 3 IC50
Activity Spreadsheet -- Enzyme Inhibition Constant Data from BindingDB
Found 3 hits for monomerid = 2121
Trg + Lig
Ki
nM
ΔG°
kcal/mole
IC50
nM
Kd
nM
EC50/IC50
nM
koff
s-1
kon
M-1s-1
pHTemp
°C
HIV-1 Reverse Transcriptase
(Human immunodeficiency virus type 1)
BDBM2121
(1-(5-chloropyridin-2-yl)-3-{2-[3-(dimethylamino)-2...)
Show SMILES CN(C)c1ccc(F)c(CCNC(=S)Nc2ccc(Cl)cn2)c1F
Show InChI InChI=1S/C16H17ClF2N4S/c1-23(2)13-5-4-12(18)11(15(13)19)7-8-20-16(24)22-14-6-3-10(17)9-21-14/h3-6,9H,7-8H2,1-2H3,(H2,20,21,22,24)
n/an/a 8n/an/an/an/a7.837
Lilly Research Laboratories
Assay Description
The IC50 of reverse transcriptase is the concentration that inhibits 50% of recombinant HIV-1 RT RNA-directed DNA polymerase activity in vitro.
J Med Chem 39: 4261-74 (1996)
Article DOI: 10.1021/jm950639r
BindingDB Entry DOI: 10.7270/Q2542KSN
HIV-1 Reverse Transcriptase Mutant (Y181C)
(Human immunodeficiency virus type 1)
BDBM2121
(1-(5-chloropyridin-2-yl)-3-{2-[3-(dimethylamino)-2...)
Show SMILES CN(C)c1ccc(F)c(CCNC(=S)Nc2ccc(Cl)cn2)c1F
Show InChI InChI=1S/C16H17ClF2N4S/c1-23(2)13-5-4-12(18)11(15(13)19)7-8-20-16(24)22-14-6-3-10(17)9-21-14/h3-6,9H,7-8H2,1-2H3,(H2,20,21,22,24)
n/an/a 190n/an/an/an/a7.837
Lilly Research Laboratories
Assay Description
The IC50 of reverse transcriptase is the concentration that inhibits 50% of recombinant HIV-1 RT RNA-directed DNA polymerase activity in vitro.
J Med Chem 39: 4261-74 (1996)
Article DOI: 10.1021/jm950639r
BindingDB Entry DOI: 10.7270/Q2542KSN
HIV-1 Reverse Transcriptase Mutant (L100I)
(Human immunodeficiency virus type 1)
BDBM2121
(1-(5-chloropyridin-2-yl)-3-{2-[3-(dimethylamino)-2...)
Show SMILES CN(C)c1ccc(F)c(CCNC(=S)Nc2ccc(Cl)cn2)c1F
Show InChI InChI=1S/C16H17ClF2N4S/c1-23(2)13-5-4-12(18)11(15(13)19)7-8-20-16(24)22-14-6-3-10(17)9-21-14/h3-6,9H,7-8H2,1-2H3,(H2,20,21,22,24)
n/an/a 1.90E+3n/an/an/an/a7.837
Lilly Research Laboratories
Assay Description
The IC50 of reverse transcriptase is the concentration that inhibits 50% of recombinant HIV-1 RT RNA-directed DNA polymerase activity in vitro.
J Med Chem 39: 4261-74 (1996)
Article DOI: 10.1021/jm950639r
BindingDB Entry DOI: 10.7270/Q2542KSN