BDBM21212 N-[6-(3,5-dimethyl-1H-pyrazol-1-yl)-2-(5-methylfuran-2-yl)pyrimidin-4-yl]-3-[(3S)-3-(dimethylamino)pyrrolidin-1-yl]propanamide::Pyrimidin-4-ylacetamide, 27
SMILES: CN(C)[C@H]1CCN(CCC(=O)Nc2cc(nc(n2)-c2ccc(C)o2)-n2nc(C)cc2C)C1
InChI Key: InChIKey=FVYCZVOQAJZLBF-SFHVURJKSA-N
Data: 3 KI  1 IC50
Activity Spreadsheet -- Enzyme Inhibition Constant Data from BindingDB
Found 4 hits for monomerid = 21212
Trg + Lig
Ki
nM
ΔG°
kcal/mole
IC50
nM
Kd
nM
EC50/IC50
nM
koff
s-1
kon
M-1s-1
pHTemp
°C
Adenosine receptor A2a
(Homo sapiens (Human))
BDBM21212
(N-[6-(3,5-dimethyl-1H-pyrazol-1-yl)-2-(5-methylfur...)
Show SMILES CN(C)[C@H]1CCN(CCC(=O)Nc2cc(nc(n2)-c2ccc(C)o2)-n2nc(C)cc2C)C1 |r|
Show InChI InChI=1S/C23H31N7O2/c1-15-12-16(2)30(27-15)21-13-20(25-23(26-21)19-7-6-17(3)32-19)24-22(31)9-11-29-10-8-18(14-29)28(4)5/h6-7,12-13,18H,8-11,14H2,1-5H3,(H,24,25,26,31)/t18-/m0/s1
NCI pathway
Reactome pathway
2.40 -11.6n/an/an/an/an/a7.422
Neuroscience
Assay Description
The membranes prepared from Flp-In HEK cells transfected with adenosine receptors were used in binding assays. Nonspecific binding was determined in ...
J Med Chem 51: 1730-9 (2008)
Article DOI: 10.1021/jm701187w
BindingDB Entry DOI: 10.7270/Q2RF5S9C
Adenosine Receptors A2a (A2a)
(Rattus norvegicus (rat))
BDBM21212
(N-[6-(3,5-dimethyl-1H-pyrazol-1-yl)-2-(5-methylfur...)
Show SMILES CN(C)[C@H]1CCN(CCC(=O)Nc2cc(nc(n2)-c2ccc(C)o2)-n2nc(C)cc2C)C1 |r|
Show InChI InChI=1S/C23H31N7O2/c1-15-12-16(2)30(27-15)21-13-20(25-23(26-21)19-7-6-17(3)32-19)24-22(31)9-11-29-10-8-18(14-29)28(4)5/h6-7,12-13,18H,8-11,14H2,1-5H3,(H,24,25,26,31)/t18-/m0/s1
Reactome pathway
41n/an/an/an/an/an/an/an/a
Neuroscience
Assay Description
The membranes prepared from Flp-In HEK cells transfected with adenosine receptors were used in binding assays. Nonspecific binding was determined in ...
J Med Chem 51: 1730-9 (2008)
Article DOI: 10.1021/jm701187w
BindingDB Entry DOI: 10.7270/Q2RF5S9C
Adenosine receptor A1
(Homo sapiens (Human))
BDBM21212
(N-[6-(3,5-dimethyl-1H-pyrazol-1-yl)-2-(5-methylfur...)
Show SMILES CN(C)[C@H]1CCN(CCC(=O)Nc2cc(nc(n2)-c2ccc(C)o2)-n2nc(C)cc2C)C1 |r|
Show InChI InChI=1S/C23H31N7O2/c1-15-12-16(2)30(27-15)21-13-20(25-23(26-21)19-7-6-17(3)32-19)24-22(31)9-11-29-10-8-18(14-29)28(4)5/h6-7,12-13,18H,8-11,14H2,1-5H3,(H,24,25,26,31)/t18-/m0/s1
Reactome pathway
630n/an/an/an/an/an/an/an/a
Neuroscience
Assay Description
The membranes prepared from Flp-In HEK cells transfected with adenosine receptors were used in binding assays. Nonspecific binding was determined in ...
J Med Chem 51: 1730-9 (2008)
Article DOI: 10.1021/jm701187w
BindingDB Entry DOI: 10.7270/Q2RF5S9C
Potassium voltage-gated channel subfamily H member 2
(Homo sapiens (Human))
BDBM21212
(N-[6-(3,5-dimethyl-1H-pyrazol-1-yl)-2-(5-methylfur...)
Show SMILES CN(C)[C@H]1CCN(CCC(=O)Nc2cc(nc(n2)-c2ccc(C)o2)-n2nc(C)cc2C)C1 |r|
Show InChI InChI=1S/C23H31N7O2/c1-15-12-16(2)30(27-15)21-13-20(25-23(26-21)19-7-6-17(3)32-19)24-22(31)9-11-29-10-8-18(14-29)28(4)5/h6-7,12-13,18H,8-11,14H2,1-5H3,(H,24,25,26,31)/t18-/m0/s1
Reactome pathway
n/an/a 2.28E+3n/an/an/an/an/an/a
Neuroscience
Assay Description
A preclinical assay was used to determine whether drug candidates inhibit hERG by examining their ability to block the potassium tail currents in HEK...
J Med Chem 51: 1730-9 (2008)
Article DOI: 10.1021/jm701187w
BindingDB Entry DOI: 10.7270/Q2RF5S9C