BDBM21237 2-mercaptopyrimidine analogue, 5p::N-[6-(2-phenylethoxy)-2-(propylsulfanyl)pyrimidin-4-yl]acetamide
SMILES: CCCSc1nc(NC(C)=O)cc(OCCc2ccccc2)n1
InChI Key: InChIKey=RGPCIPPBXWHJOD-UHFFFAOYSA-N
Data: 2 KI  1 EC50
Activity Spreadsheet -- Enzyme Inhibition Constant Data from BindingDB
Found 3 hits for monomerid = 21237
Trg + Lig
Ki
nM
ΔG°
kcal/mole
IC50
nM
Kd
nM
EC50/IC50
nM
koff
s-1
kon
M-1s-1
pHTemp
°C
Adenosine receptor A3
(Homo sapiens (Human))
BDBM21237
(2-mercaptopyrimidine analogue, 5p | N-[6-(2-phenyl...)
Show SMILES CCCSc1nc(NC(C)=O)cc(OCCc2ccccc2)n1
Show InChI InChI=1S/C17H21N3O2S/c1-3-11-23-17-19-15(18-13(2)21)12-16(20-17)22-10-9-14-7-5-4-6-8-14/h4-8,12H,3,9-11H2,1-2H3,(H,18,19,20,21)
Reactome pathway
1.40n/an/an/a 1.25n/an/an/an/a
Universita di Napoli
Assay Description
The membranes prepared from CHO cells transfected with human adenosine A3 receptors were used in binding assays. Nonspecific binding was determined i...
J Med Chem 51: 1764-70 (2008)
Article DOI: 10.1021/jm701159t
BindingDB Entry DOI: 10.7270/Q2MP51JK
Adenosine receptor A1
(Homo sapiens (Human))
BDBM21237
(2-mercaptopyrimidine analogue, 5p | N-[6-(2-phenyl...)
Show SMILES CCCSc1nc(NC(C)=O)cc(OCCc2ccccc2)n1
Show InChI InChI=1S/C17H21N3O2S/c1-3-11-23-17-19-15(18-13(2)21)12-16(20-17)22-10-9-14-7-5-4-6-8-14/h4-8,12H,3,9-11H2,1-2H3,(H,18,19,20,21)
Reactome pathway
2.08E+3 -7.75n/an/an/an/an/a7.425
Universita di Napoli
Assay Description
The membranes prepared from CHO cells transfected with human adenosine A1 receptors were used in binding assays. Nonspecific binding was determined i...
J Med Chem 51: 1764-70 (2008)
Article DOI: 10.1021/jm701159t
BindingDB Entry DOI: 10.7270/Q2MP51JK
Adenosine receptor A2a
(Homo sapiens (Human))
BDBM21237
(2-mercaptopyrimidine analogue, 5p | N-[6-(2-phenyl...)
Show SMILES CCCSc1nc(NC(C)=O)cc(OCCc2ccccc2)n1
Show InChI InChI=1S/C17H21N3O2S/c1-3-11-23-17-19-15(18-13(2)21)12-16(20-17)22-10-9-14-7-5-4-6-8-14/h4-8,12H,3,9-11H2,1-2H3,(H,18,19,20,21)
NCI pathway
Reactome pathway
n/an/an/an/an/an/an/an/an/a
Universita di Napoli
Assay Description
The membranes prepared from CHO cells transfected with human adenosine A2A receptors were used in binding assays. Nonspecific binding was determined ...
J Med Chem 51: 1764-70 (2008)
Article DOI: 10.1021/jm701159t
BindingDB Entry DOI: 10.7270/Q2MP51JK