BDBM21249 1-(4-chlorophenyl)-N-cyclohexyl-5-(1H-pyrrol-1-yl)-1H-pyrazole-3-carboxamide::Pyrazole-3-carboxamide analogue, 16
SMILES: Clc1ccc(cc1)-n1nc(cc1-n1cccc1)C(=O)NC1CCCCC1
InChI Key: InChIKey=JRJFRWURMSBKJJ-UHFFFAOYSA-N
Data: 2 KI
Activity Spreadsheet -- Enzyme Inhibition Constant Data from BindingDB
Found 2 hits for monomerid = 21249
Trg + Lig
Ki
nM
ΔG°
kcal/mole
IC50
nM
Kd
nM
EC50/IC50
nM
koff
s-1
kon
M-1s-1
pHTemp
°C
Cannabinoid receptor 1
(Homo sapiens (Human))
BDBM21249
(1-(4-chlorophenyl)-N-cyclohexyl-5-(1H-pyrrol-1-yl)...)
Show SMILES Clc1ccc(cc1)-n1nc(cc1-n1cccc1)C(=O)NC1CCCCC1
Show InChI InChI=1S/C20H21ClN4O/c21-15-8-10-17(11-9-15)25-19(24-12-4-5-13-24)14-18(23-25)20(26)22-16-6-2-1-3-7-16/h4-5,8-14,16H,1-3,6-7H2,(H,22,26)
NCI pathway
Reactome pathway
280 -9.08n/an/an/an/an/a7.430
Sapienza Universitāadi Roma
Assay Description
IC50 values for test compounds were determined from nonlinear regression analysis of data collected from ligand binding experiments. The inhibition c...
J Med Chem 51: 1560-76 (2008)
Article DOI: 10.1021/jm070566z
BindingDB Entry DOI: 10.7270/Q2GX48V9
Cannabinoid receptor 2
(Homo sapiens (Human))
BDBM21249
(1-(4-chlorophenyl)-N-cyclohexyl-5-(1H-pyrrol-1-yl)...)
Show SMILES Clc1ccc(cc1)-n1nc(cc1-n1cccc1)C(=O)NC1CCCCC1
Show InChI InChI=1S/C20H21ClN4O/c21-15-8-10-17(11-9-15)25-19(24-12-4-5-13-24)14-18(23-25)20(26)22-16-6-2-1-3-7-16/h4-5,8-14,16H,1-3,6-7H2,(H,22,26)
Reactome pathway
1.75E+3n/an/an/an/an/an/an/an/a
Sapienza Universitāadi Roma
Assay Description
IC50 values for test compounds were determined from nonlinear regression analysis of data collected from ligand binding experiments. The inhibition c...
J Med Chem 51: 1560-76 (2008)
Article DOI: 10.1021/jm070566z
BindingDB Entry DOI: 10.7270/Q2GX48V9