BDBM212607 US9278953, 11
SMILES: Cn1ncc2c(F)cc(cc12)-c1ccc(c(=O)[nH]1)[C@@]1(C)CCCNC1=O
InChI Key:
Data: 1 KI
Activity Spreadsheet -- Enzyme Inhibition Constant Data from BindingDB
Found 1 hit for monomerid = 212607
Trg + Lig
Ki
nM
ΔG°
kcal/mole
IC50
nM
Kd
nM
EC50/IC50
nM
koff
s-1
kon
M-1s-1
pHTemp
°C
Prostaglandin E2 receptor
(Homo sapiens (Human))
BDBM212607
(US9278953, 11)
Show SMILES Cn1ncc2c(F)cc(cc12)-c1ccc(c(=O)[nH]1)[C@@]1(C)CCCNC1=O |r|
US Patent
13.9 -10.7n/an/an/an/an/a7.425
Pfizer Inc.
US Patent
Assay Description
Test compounds were half log serially diluted in 100% DMSO (J. T. Baker #922401). 1 uL of each compound was added to appropriate wells of a 384-well ...
US Patent US9278953 (2016)
BindingDB Entry DOI: 10.7270/Q2W37V5Z