BDBM21294 1-(oxan-4-ylmethyl)-3-[(2,2,3,3-tetramethylcyclopropyl)carbonyl]-1H-indol-4-ol::Tetrahydropyranyl-methyl analogue, 15
SMILES: CC1(C)C(C(=O)c2cn(CC3CCOCC3)c3cccc(O)c23)C1(C)C
InChI Key: InChIKey=BRXJBOGZEFKWPQ-UHFFFAOYSA-N
Data: 2 KI  1 EC50
Activity Spreadsheet -- Enzyme Inhibition Constant Data from BindingDB
Found 2 hits for monomerid = 21294
Trg + Lig
Ki
nM
ΔG°
kcal/mole
IC50
nM
Kd
nM
EC50/IC50
nM
koff
s-1
kon
M-1s-1
pHTemp
°C
Cannabinoid receptor 2
(Homo sapiens (Human))
BDBM21294
(1-(oxan-4-ylmethyl)-3-[(2,2,3,3-tetramethylcyclopr...)
Show SMILES CC1(C)C(C(=O)c2cn(CC3CCOCC3)c3cccc(O)c23)C1(C)C
Show InChI InChI=1S/C22H29NO3/c1-21(2)20(22(21,3)4)19(25)15-13-23(12-14-8-10-26-11-9-14)16-6-5-7-17(24)18(15)16/h5-7,13-14,20,24H,8-12H2,1-4H3
Reactome pathway
3.90n/an/an/a 73n/an/an/an/a
Abbott Laboratories
Assay Description
IC50 values for test compounds were determined from nonlinear regression analysis of data collected from ligand binding experiments. The inhibition c...
J Med Chem 51: 1904-12 (2008)
Article DOI: 10.1021/jm7011613
BindingDB Entry DOI: 10.7270/Q2C827K2
Cannabinoid receptor 1
(Homo sapiens (Human))
BDBM21294
(1-(oxan-4-ylmethyl)-3-[(2,2,3,3-tetramethylcyclopr...)
Show SMILES CC1(C)C(C(=O)c2cn(CC3CCOCC3)c3cccc(O)c23)C1(C)C
Show InChI InChI=1S/C22H29NO3/c1-21(2)20(22(21,3)4)19(25)15-13-23(12-14-8-10-26-11-9-14)16-6-5-7-17(24)18(15)16/h5-7,13-14,20,24H,8-12H2,1-4H3
NCI pathway
Reactome pathway
388 -8.89n/an/an/an/an/a7.430
Abbott Laboratories
Assay Description
IC50 values for test compounds were determined from nonlinear regression analysis of data collected from ligand binding experiments. The inhibition c...
J Med Chem 51: 1904-12 (2008)
Article DOI: 10.1021/jm7011613
BindingDB Entry DOI: 10.7270/Q2C827K2