BDBM212967 US9278960, 4-51::US9663506, Example 4-51
SMILES: Cc1ncc(s1)-c1cc(nc2cc(CN3CCOC(C3)C(F)(F)F)ccc12)C(N)=O
InChI Key: InChIKey=QYGZQJAQOQLFSQ-UHFFFAOYSA-N
Data: 3 IC50
Activity Spreadsheet -- Enzyme Inhibition Constant Data from BindingDB
Found 3 hits for monomerid = 212967
Trg + Lig
Ki
nM
ΔG°
kcal/mole
IC50
nM
Kd
nM
EC50/IC50
nM
koff
s-1
kon
M-1s-1
pHTemp
°C
mGluR2 and G alpha 16
(Homo sapiens (Human))
BDBM212967
(US9278960, 4-51 | US9663506, Example 4-51)
Show SMILES Cc1ncc(s1)-c1cc(nc2cc(CN3CCOC(C3)C(F)(F)F)ccc12)C(N)=O
Show InChI InChI=1S/C20H19F3N4O2S/c1-11-25-8-17(30-11)14-7-16(19(24)28)26-15-6-12(2-3-13(14)15)9-27-4-5-29-18(10-27)20(21,22)23/h2-3,6-8,18H,4-5,9-10H2,1H3,(H2,24,28)
US Patent
n/an/a 9n/an/an/an/an/an/a
Merck Sharp & Dohme Corp.
US Patent
Assay Description
The utility of the compounds in accordance with the present invention as antagonists of metabotropic glutamate receptor activity, in particular mGluR...
US Patent US9278960 (2016)
BindingDB Entry DOI: 10.7270/Q2MK6BQW
Metabotropic glutamate receptor 2
(Homo sapiens (Human))
BDBM212967
(US9278960, 4-51 | US9663506, Example 4-51)
Show SMILES Cc1ncc(s1)-c1cc(nc2cc(CN3CCOC(C3)C(F)(F)F)ccc12)C(N)=O
Show InChI InChI=1S/C20H19F3N4O2S/c1-11-25-8-17(30-11)14-7-16(19(24)28)26-15-6-12(2-3-13(14)15)9-27-4-5-29-18(10-27)20(21,22)23/h2-3,6-8,18H,4-5,9-10H2,1H3,(H2,24,28)
US Patent
n/an/a 9n/an/an/an/an/an/a
Merck Sharp & Dohme Corp.
US Patent
Assay Description
The utility of the compounds in accordance with the present invention as antagonists of metabotropic glutamate receptor activity, in particular mGluR...
US Patent US9663506 (2017)
BindingDB Entry DOI: 10.7270/Q2PC34H4
Metabotropic glutamate receptor 2
(Homo sapiens (Human))
BDBM212967
(US9278960, 4-51 | US9663506, Example 4-51)
Show SMILES Cc1ncc(s1)-c1cc(nc2cc(CN3CCOC(C3)C(F)(F)F)ccc12)C(N)=O
Show InChI InChI=1S/C20H19F3N4O2S/c1-11-25-8-17(30-11)14-7-16(19(24)28)26-15-6-12(2-3-13(14)15)9-27-4-5-29-18(10-27)20(21,22)23/h2-3,6-8,18H,4-5,9-10H2,1H3,(H2,24,28)
US Patent
n/an/a 9n/an/an/an/an/an/a
Merck Sharp & Dohme Corp.
US Patent
Assay Description
The utility of the compounds in accordance with the present invention as antagonists of metabotropic glutamate receptor activity, in particular mGluR...
US Patent US9636337 (2017)
BindingDB Entry DOI: 10.7270/Q2F191TK