BDBM21322 Morpholino-ethyl analogue, 43::N-{1-[2-(morpholin-4-yl)ethyl]-3-[(2,2,3,3-tetramethylcyclopropyl)carbonyl]-1H-indol-4-yl}methanesulfonamide
SMILES: CC1(C)C(C(=O)c2cn(CCN3CCOCC3)c3cccc(NS(C)(=O)=O)c23)C1(C)C
InChI Key: InChIKey=IMVPJCWCKUNHSI-UHFFFAOYSA-N
Data: 2 KI  1 EC50
Activity Spreadsheet -- Enzyme Inhibition Constant Data from BindingDB
Found 2 hits for monomerid = 21322
Trg + Lig
Ki
nM
ΔG°
kcal/mole
IC50
nM
Kd
nM
EC50/IC50
nM
koff
s-1
kon
M-1s-1
pHTemp
°C
Cannabinoid receptor 2
(Homo sapiens (Human))
BDBM21322
(Morpholino-ethyl analogue, 43 | N-{1-[2-(morpholin...)
Show SMILES CC1(C)C(C(=O)c2cn(CCN3CCOCC3)c3cccc(NS(C)(=O)=O)c23)C1(C)C
Show InChI InChI=1S/C23H33N3O4S/c1-22(2)21(23(22,3)4)20(27)16-15-26(10-9-25-11-13-30-14-12-25)18-8-6-7-17(19(16)18)24-31(5,28)29/h6-8,15,21,24H,9-14H2,1-5H3
Reactome pathway
>1.00E+3n/an/an/a>1.00E+4n/an/an/an/a
Abbott Laboratories
Assay Description
IC50 values for test compounds were determined from nonlinear regression analysis of data collected from ligand binding experiments. The inhibition c...
J Med Chem 51: 1904-12 (2008)
Article DOI: 10.1021/jm7011613
BindingDB Entry DOI: 10.7270/Q2C827K2
Cannabinoid receptor 1
(Homo sapiens (Human))
BDBM21322
(Morpholino-ethyl analogue, 43 | N-{1-[2-(morpholin...)
Show SMILES CC1(C)C(C(=O)c2cn(CCN3CCOCC3)c3cccc(NS(C)(=O)=O)c23)C1(C)C
Show InChI InChI=1S/C23H33N3O4S/c1-22(2)21(23(22,3)4)20(27)16-15-26(10-9-25-11-13-30-14-12-25)18-8-6-7-17(19(16)18)24-31(5,28)29/h6-8,15,21,24H,9-14H2,1-5H3
NCI pathway
Reactome pathway
4.08E+3n/an/an/an/an/an/an/an/a
Abbott Laboratories
Assay Description
IC50 values for test compounds were determined from nonlinear regression analysis of data collected from ligand binding experiments. The inhibition c...
J Med Chem 51: 1904-12 (2008)
Article DOI: 10.1021/jm7011613
BindingDB Entry DOI: 10.7270/Q2C827K2