BDBM213589 US9278981, 181
SMILES: CN(CCO)c1ncc(cc1-c1cncc(c1)C#N)C(=O)Nc1ccc(OC(F)(F)Cl)cc1
InChI Key: InChIKey=XKRULHQNJBGDON-UHFFFAOYSA-N
Data: 4 IC50
Activity Spreadsheet -- Enzyme Inhibition Constant Data from BindingDB
Found 4 hits for monomerid = 213589
Trg + Lig
Ki
nM
ΔG°
kcal/mole
IC50
nM
Kd
nM
EC50/IC50
nM
koff
s-1
kon
M-1s-1
pHTemp
°C
Tyrosine-protein kinase ABL1
(Homo sapiens (Human))
BDBM213589
(US9278981, 181)
Show SMILES CN(CCO)c1ncc(cc1-c1cncc(c1)C#N)C(=O)Nc1ccc(OC(F)(F)Cl)cc1
Show InChI InChI=1S/C22H18ClF2N5O3/c1-30(6-7-31)20-19(15-8-14(10-26)11-27-12-15)9-16(13-28-20)21(32)29-17-2-4-18(5-3-17)33-22(23,24)25/h2-5,8-9,11-13,31H,6-7H2,1H3,(H,29,32)
US Patent
n/an/a 4n/an/an/an/a7.525
Novartis AG
US Patent
Assay Description
For determination of ABL kinase activity, the radiometric filter-binding assay was used. The assay was performed by mixing 10 uL of the compound pre-...
US Patent US9278981 (2016)
BindingDB Entry DOI: 10.7270/Q2DV1HRD
Tyrosine-protein kinase ABL1
(Homo sapiens (Human))
BDBM213589
(US9278981, 181)
Show SMILES CN(CCO)c1ncc(cc1-c1cncc(c1)C#N)C(=O)Nc1ccc(OC(F)(F)Cl)cc1
Show InChI InChI=1S/C22H18ClF2N5O3/c1-30(6-7-31)20-19(15-8-14(10-26)11-27-12-15)9-16(13-28-20)21(32)29-17-2-4-18(5-3-17)33-22(23,24)25/h2-5,8-9,11-13,31H,6-7H2,1H3,(H,29,32)
Reactome pathway
US Patent
n/an/a 38n/an/an/an/an/an/a
Novartis AG
US Patent
Assay Description
Test compounds were resuspended in DMSO at a concentration of 10 mM. A serial three-fold dilution of each compound with DMSO was performed in 384-wel...
US Patent US9278981 (2016)
BindingDB Entry DOI: 10.7270/Q2DV1HRD
Tyrosine-protein kinase ABL1
(Homo sapiens (Human))
BDBM213589
(US9278981, 181)
Show SMILES CN(CCO)c1ncc(cc1-c1cncc(c1)C#N)C(=O)Nc1ccc(OC(F)(F)Cl)cc1
Show InChI InChI=1S/C22H18ClF2N5O3/c1-30(6-7-31)20-19(15-8-14(10-26)11-27-12-15)9-16(13-28-20)21(32)29-17-2-4-18(5-3-17)33-22(23,24)25/h2-5,8-9,11-13,31H,6-7H2,1H3,(H,29,32)
Reactome pathway
US Patent
n/an/a 1.40n/an/an/an/an/an/a
Novartis AG
US Patent
Assay Description
Test compounds were resuspended in DMSO at a concentration of 10 mM. A serial three-fold dilution of each compound with DMSO was performed in 384-wel...
US Patent US9278981 (2016)
BindingDB Entry DOI: 10.7270/Q2DV1HRD
Tyrosine-protein kinase ABL1
(Homo sapiens (Human))
BDBM213589
(US9278981, 181)
Show SMILES CN(CCO)c1ncc(cc1-c1cncc(c1)C#N)C(=O)Nc1ccc(OC(F)(F)Cl)cc1
Show InChI InChI=1S/C22H18ClF2N5O3/c1-30(6-7-31)20-19(15-8-14(10-26)11-27-12-15)9-16(13-28-20)21(32)29-17-2-4-18(5-3-17)33-22(23,24)25/h2-5,8-9,11-13,31H,6-7H2,1H3,(H,29,32)
US Patent
n/an/a 0.200n/an/an/an/a7.530
Novartis AG
US Patent
Assay Description
The assay plates were prepared by addition of 50 nL per well of compound solution in 90% DMSO. The kinase reactions were started by stepwise addition...
US Patent US9278981 (2016)
BindingDB Entry DOI: 10.7270/Q2DV1HRD