BDBM213762 US9284299, 13
SMILES: On1ncc2cc(CCc3noc(=O)[nH]3)ccc12
InChI Key: InChIKey=LQSZWBBCHDUGGI-UHFFFAOYSA-N
Data: 1 KI
Activity Spreadsheet -- Enzyme Inhibition Constant Data from BindingDB
Found 1 hit for monomerid = 213762
Trg + Lig
Ki
nM
ΔG°
kcal/mole
IC50
nM
Kd
nM
EC50/IC50
nM
koff
s-1
kon
M-1s-1
pHTemp
°C
Beta-catenin
(Homo sapiens (Human))
BDBM213762
(US9284299, 13)
Show SMILES On1ncc2cc(CCc3noc(=O)[nH]3)ccc12
Show InChI InChI=1S/C11H10N4O3/c16-11-13-10(14-18-11)4-2-7-1-3-9-8(5-7)6-12-15(9)17/h1,3,5-6,17H,2,4H2,(H,13,14,16)
US Patent
9.77E+4 -5.47n/an/an/an/an/an/a25
University of Utah Research Foundation
US Patent
Assay Description
Experiments were performed in 96-well Microfluor 2 black plates (Waltham, Mass.), and the samples were read by a Synergy 2 plate reader (Biotek, Wino...
US Patent US9284299 (2016)
BindingDB Entry DOI: 10.7270/Q2WW7GGC