null
SMILES: Fc1ccccc1N1CCN(CCCCCC(=O)NC2CCCc3ccccc23)CC1
InChI Key: InChIKey=GJXLROXNFUKMEK-UHFFFAOYSA-N
Activity Spreadsheet -- Enzyme Inhibition Constant Data from BindingDB
Found 4 hits for monomerid = 21389
Trg + Lig
Ki
nM
ΔG°
kcal/mole
IC50
nM
Kd
nM
EC50/IC50
nM
koff
s-1
kon
M-1s-1
pHTemp
°C
5-hydroxytryptamine receptor 1A
(Homo sapiens (Human))
BDBM21389
(6-[4-(2-fluorophenyl)piperazin-1-yl]-N-(1,2,3,4-te...)
Show SMILES Fc1ccccc1N1CCN(CCCCCC(=O)NC2CCCc3ccccc23)CC1
Show InChI InChI=1S/C26H34FN3O/c27-23-12-5-6-14-25(23)30-19-17-29(18-20-30)16-7-1-2-15-26(31)28-24-13-8-10-21-9-3-4-11-22(21)24/h3-6,9,11-12,14,24H,1-2,7-8,10,13,15-20H2,(H,28,31)
29.2n/an/an/an/an/an/an/an/a
Universita degli Studi di Bari
Assay Description
IC50 values for each test compound were determined from nonlinear regression analysis of data collected from ligand binding experiments. The inhibiti...
J Med Chem 50: 4214-21 (2007)
Article DOI: 10.1021/jm070487n
BindingDB Entry DOI: 10.7270/Q20000CJ
5-hydroxytryptamine receptor 7
(Rattus norvegicus (rat))
BDBM21389
(6-[4-(2-fluorophenyl)piperazin-1-yl]-N-(1,2,3,4-te...)
Show SMILES Fc1ccccc1N1CCN(CCCCCC(=O)NC2CCCc3ccccc23)CC1
Show InChI InChI=1S/C26H34FN3O/c27-23-12-5-6-14-25(23)30-19-17-29(18-20-30)16-7-1-2-15-26(31)28-24-13-8-10-21-9-3-4-11-22(21)24/h3-6,9,11-12,14,24H,1-2,7-8,10,13,15-20H2,(H,28,31)
Reactome pathway
131 -9.76n/an/an/an/an/a7.437
Universita degli Studi di Bari
Assay Description
IC50 values for each test compound were determined from nonlinear regression analysis of data collected from ligand binding experiments. The inhibiti...
J Med Chem 50: 4214-21 (2007)
Article DOI: 10.1021/jm070487n
BindingDB Entry DOI: 10.7270/Q20000CJ
5-hydroxytryptamine receptor 2A
(Rattus norvegicus (rat))
BDBM21389
(6-[4-(2-fluorophenyl)piperazin-1-yl]-N-(1,2,3,4-te...)
Show SMILES Fc1ccccc1N1CCN(CCCCCC(=O)NC2CCCc3ccccc23)CC1
Show InChI InChI=1S/C26H34FN3O/c27-23-12-5-6-14-25(23)30-19-17-29(18-20-30)16-7-1-2-15-26(31)28-24-13-8-10-21-9-3-4-11-22(21)24/h3-6,9,11-12,14,24H,1-2,7-8,10,13,15-20H2,(H,28,31)
Reactome pathway
194n/an/an/an/an/an/an/an/a
Universita degli Studi di Bari
Assay Description
IC50 values for each test compound were determined from nonlinear regression analysis of data collected from ligand binding experiments. The inhibiti...
J Med Chem 50: 4214-21 (2007)
Article DOI: 10.1021/jm070487n
BindingDB Entry DOI: 10.7270/Q20000CJ
D(2) dopamine receptor
(Homo sapiens (Human))
BDBM21389
(6-[4-(2-fluorophenyl)piperazin-1-yl]-N-(1,2,3,4-te...)
Show SMILES Fc1ccccc1N1CCN(CCCCCC(=O)NC2CCCc3ccccc23)CC1
Show InChI InChI=1S/C26H34FN3O/c27-23-12-5-6-14-25(23)30-19-17-29(18-20-30)16-7-1-2-15-26(31)28-24-13-8-10-21-9-3-4-11-22(21)24/h3-6,9,11-12,14,24H,1-2,7-8,10,13,15-20H2,(H,28,31)
Reactome pathway
292n/an/an/an/an/an/an/an/a
Universita degli Studi di Bari
Assay Description
IC50 values for each test compound were determined from nonlinear regression analysis of data collected from ligand binding experiments. The inhibiti...
J Med Chem 50: 4214-21 (2007)
Article DOI: 10.1021/jm070487n
BindingDB Entry DOI: 10.7270/Q20000CJ