BDBM214580 US9283222, 704
SMILES: Fc1ccc(Cc2n[nH]c(=O)c3CCCNc23)cc1C(=O)N1CCN(CC1)C(=O)c1cc[nH]n1
InChI Key: InChIKey=HXRDYCYTLOKHMT-UHFFFAOYSA-N
Data: 1 KI
Activity Spreadsheet -- Enzyme Inhibition Constant Data from BindingDB
Found 1 hit for monomerid = 214580
Trg + Lig
Ki
nM
ΔG°
kcal/mole
IC50
nM
Kd
nM
EC50/IC50
nM
koff
s-1
kon
M-1s-1
pHTemp
°C
Poly [ADP-ribose] polymerase 1
(Homo sapiens (Human))
BDBM214580
(US9283222, 704)
Show SMILES Fc1ccc(Cc2n[nH]c(=O)c3CCCNc23)cc1C(=O)N1CCN(CC1)C(=O)c1cc[nH]n1
Show InChI InChI=1S/C23H24FN7O3/c24-17-4-3-14(13-19-20-15(2-1-6-25-20)21(32)29-28-19)12-16(17)22(33)30-8-10-31(11-9-30)23(34)18-5-7-26-27-18/h3-5,7,12,25H,1-2,6,8-11,13H2,(H,26,27)(H,29,32)
US Patent
0.600n/an/an/an/an/an/a8.0n/a
AbbVie Inc.
US Patent
Assay Description
PARP1 assay was conducted in PARP assay buffer containing 50 mM Tris pH 8.0, 1 mM DTT, 4 mM MgCl2. PARP reactions contained 1.5 uM [3H]-NAD+ (1.6 uCi...
US Patent US9283222 (2016)
BindingDB Entry DOI: 10.7270/Q2BZ64XD