BDBM214589 US9283222, 714
SMILES: Fc1ccc(Cc2n[nH]c(=O)c3CCCCc23)cc1C(=O)NCCN1CCCC1=O
InChI Key: InChIKey=GBXWXOPVZLZZNH-UHFFFAOYSA-N
Data: 1 KI
Activity Spreadsheet -- Enzyme Inhibition Constant Data from BindingDB
Found 1 hit for monomerid = 214589
Trg + Lig
Ki
nM
ΔG°
kcal/mole
IC50
nM
Kd
nM
EC50/IC50
nM
koff
s-1
kon
M-1s-1
pHTemp
°C
Poly [ADP-ribose] polymerase 1
(Homo sapiens (Human))
BDBM214589
(US9283222, 714)
Show SMILES Fc1ccc(Cc2n[nH]c(=O)c3CCCCc23)cc1C(=O)NCCN1CCCC1=O
Show InChI InChI=1S/C22H25FN4O3/c23-18-8-7-14(13-19-15-4-1-2-5-16(15)22(30)26-25-19)12-17(18)21(29)24-9-11-27-10-3-6-20(27)28/h7-8,12H,1-6,9-11,13H2,(H,24,29)(H,26,30)
US Patent
0.800n/an/an/an/an/an/a8.0n/a
AbbVie Inc.
US Patent
Assay Description
PARP1 assay was conducted in PARP assay buffer containing 50 mM Tris pH 8.0, 1 mM DTT, 4 mM MgCl2. PARP reactions contained 1.5 uM [3H]-NAD+ (1.6 uCi...
US Patent US9283222 (2016)
BindingDB Entry DOI: 10.7270/Q2BZ64XD