BDBM214696 US9296728, 17
SMILES: COc1cc(ccc1\C=C(/C#N)C(O)=O)N(CC#C)CC#C
InChI Key: InChIKey=AUELJRMSNKLDTD-GXDHUFHOSA-N
Data: 1 IC50
Activity Spreadsheet -- Enzyme Inhibition Constant Data from BindingDB
Found 1 hit for monomerid = 214696
Trg + Lig
Ki
nM
ΔG°
kcal/mole
IC50
nM
Kd
nM
EC50/IC50
nM
koff
s-1
kon
M-1s-1
pHTemp
°C
Monocarboxylate transporter 1 (MCT1)
(Rattus norvegicus (Rat))
BDBM214696
(US9296728, 17)
Show SMILES COc1cc(ccc1\C=C(/C#N)C(O)=O)N(CC#C)CC#C
Show InChI InChI=1S/C17H14N2O3/c1-4-8-19(9-5-2)15-7-6-13(16(11-15)22-3)10-14(12-18)17(20)21/h1-2,6-7,10-11H,8-9H2,3H3,(H,20,21)/b14-10+
US Patent
n/an/a 91n/an/an/an/a7.4337
Regents of the University of Minnesota
US Patent
Assay Description
The entire lactate uptake studies for the inhibition of MCT1 were carried out on RBE4 (Rat Brain Endothelial 4) cells. The expression of MCT1 on thes...
US Patent US9296728 (2016)
BindingDB Entry DOI: 10.7270/Q2KH0M5R