BDBM214733 Rhodanines, 21A
SMILES: [O-]C(=O)CCN1C(=S)S\C(=C/c2ccc(o2)-c2ccc(cc2)-c2ccc(o2)C([O-])=O)C1=O
InChI Key: InChIKey=UZEIGVGCDBYWCU-WQRHYEAKSA-L
Data: 1 IC50
Activity Spreadsheet -- Enzyme Inhibition Constant Data from BindingDB
Found 1 hit for monomerid = 214733
Trg + Lig
Ki
nM
ΔG°
kcal/mole
IC50
nM
Kd
nM
EC50/IC50
nM
koff
s-1
kon
M-1s-1
pHTemp
°C
Microtubule-associated protein tau (TAU)(2N4R)
(Homo sapiens (Human))
BDBM214733
(Rhodanines, 21A)
Show SMILES [O-]C(=O)CCN1C(=S)S\C(=C/c2ccc(o2)-c2ccc(cc2)-c2ccc(o2)C([O-])=O)C1=O
Show InChI InChI=1S/C22H15NO7S2/c24-19(25)9-10-23-20(26)18(32-22(23)31)11-14-5-6-15(29-14)12-1-3-13(4-2-12)16-7-8-17(30-16)21(27)28/h1-8,11H,9-10H2,(H,24,25)(H,27,28)/p-2/b18-11-
n/an/a 170n/an/an/an/a7.4n/a
The Ohio State University
Assay Description
The Tau content of fractions was determined by dot blot analysis using nitrocellulose membranes (0.2 μm porosity) as described previously [Cisek...
J Biol Chem 288: 32599-611 (2013)
Article DOI: 10.1074/jbc.M113.503474
BindingDB Entry DOI: 10.7270/Q2R49PMK