BDBM21481 (2S)-2-{[(1S)-1-carboxy-2-{1-[(4-nitrophenyl)methyl]-1H-imidazol-5-yl}ethyl]amino}-4-methylpentanoic acid::Amino dicarboxylate analogue, 8
SMILES: CC(C)C[C@H](N[C@@H](Cc1cncn1Cc1ccc(cc1)[N+]([O-])=O)C(O)=O)C(O)=O
InChI Key: InChIKey=ULYBEZCDENOMDB-IRXDYDNUSA-N
Data: 1 IC50
Activity Spreadsheet -- Enzyme Inhibition Constant Data from BindingDB
Found 1 hit for monomerid = 21481
Trg + Lig
Ki
nM
ΔG°
kcal/mole
IC50
nM
Kd
nM
EC50/IC50
nM
koff
s-1
kon
M-1s-1
pHTemp
°C
Angiotensin-converting enzyme 2
(Homo sapiens (Human))
BDBM21481
((2S)-2-{[(1S)-1-carboxy-2-{1-[(4-nitrophenyl)methy...)
Show SMILES CC(C)C[C@H](N[C@@H](Cc1cncn1Cc1ccc(cc1)[N+]([O-])=O)C(O)=O)C(O)=O |r|
Show InChI InChI=1S/C19H24N4O6/c1-12(2)7-16(18(24)25)21-17(19(26)27)8-15-9-20-11-22(15)10-13-3-5-14(6-4-13)23(28)29/h3-6,9,11-12,16-17,21H,7-8,10H2,1-2H3,(H,24,25)(H,26,27)/t16-,17-/m0/s1
Reactome pathway
n/an/a 76n/an/an/an/a6.522
Millennium Pharmaceuticals
Assay Description
Enzyme assay was conducted in 384-well microplates format. Activity was monitored by measuring increase in fluorescence (excitation @320 nm, emission...
J Am Chem Soc 124: 11852-3 (2002)
Article DOI: 10.1021/ja0277226
BindingDB Entry DOI: 10.7270/Q2KP80FN