BDBM2152 1-(5-bromopyridin-2-yl)-3-[2-(5-methoxy-1H-indol-3-yl)ethyl]thiourea::LY300046HCl Analog 38::N-[2-[3-(5-Methoxyindolyl)]ethyl]-N-[2-(5-bromopyridyl)]thiourea::PETT deriv.
SMILES: COc1ccc2[nH]cc(CCNC(=S)Nc3ccc(Br)cn3)c2c1
InChI Key: InChIKey=ZEJLSIOKNOUHSH-UHFFFAOYSA-N
Data: 3 IC50
Activity Spreadsheet -- Enzyme Inhibition Constant Data from BindingDB
Found 3 hits for monomerid = 2152
Trg + Lig
Ki
nM
ΔG°
kcal/mole
IC50
nM
Kd
nM
EC50/IC50
nM
koff
s-1
kon
M-1s-1
pHTemp
°C
HIV-1 Reverse Transcriptase
(Human immunodeficiency virus type 1)
BDBM2152
(1-(5-bromopyridin-2-yl)-3-[2-(5-methoxy-1H-indol-3...)
Show SMILES COc1ccc2[nH]cc(CCNC(=S)Nc3ccc(Br)cn3)c2c1
Show InChI InChI=1S/C17H17BrN4OS/c1-23-13-3-4-15-14(8-13)11(9-20-15)6-7-19-17(24)22-16-5-2-12(18)10-21-16/h2-5,8-10,20H,6-7H2,1H3,(H2,19,21,22,24)
n/an/a 320n/an/an/an/an/an/a
Lilly Research Laboratories
Assay Description
The IC50 of reverse transcriptase is the concentration that inhibits 50% of recombinant HIV-1 RT RNA-directed DNA polymerase activity in vitro.
J Med Chem 39: 4261-74 (1996)
Article DOI: 10.1021/jm950639r
BindingDB Entry DOI: 10.7270/Q2542KSN
HIV-1 Reverse Transcriptase Mutant (Y181C)
(Human immunodeficiency virus type 1)
BDBM2152
(1-(5-bromopyridin-2-yl)-3-[2-(5-methoxy-1H-indol-3...)
Show SMILES COc1ccc2[nH]cc(CCNC(=S)Nc3ccc(Br)cn3)c2c1
Show InChI InChI=1S/C17H17BrN4OS/c1-23-13-3-4-15-14(8-13)11(9-20-15)6-7-19-17(24)22-16-5-2-12(18)10-21-16/h2-5,8-10,20H,6-7H2,1H3,(H2,19,21,22,24)
n/an/a 2.50E+3n/an/an/an/an/an/a
Lilly Research Laboratories
Assay Description
The IC50 of reverse transcriptase is the concentration that inhibits 50% of recombinant HIV-1 RT RNA-directed DNA polymerase activity in vitro.
J Med Chem 39: 4261-74 (1996)
Article DOI: 10.1021/jm950639r
BindingDB Entry DOI: 10.7270/Q2542KSN
HIV-1 Reverse Transcriptase Mutant (L100I)
(Human immunodeficiency virus type 1)
BDBM2152
(1-(5-bromopyridin-2-yl)-3-[2-(5-methoxy-1H-indol-3...)
Show SMILES COc1ccc2[nH]cc(CCNC(=S)Nc3ccc(Br)cn3)c2c1
Show InChI InChI=1S/C17H17BrN4OS/c1-23-13-3-4-15-14(8-13)11(9-20-15)6-7-19-17(24)22-16-5-2-12(18)10-21-16/h2-5,8-10,20H,6-7H2,1H3,(H2,19,21,22,24)
n/an/a>2.50E+3n/an/an/an/an/an/a
Lilly Research Laboratories
Assay Description
The IC50 of reverse transcriptase is the concentration that inhibits 50% of recombinant HIV-1 RT RNA-directed DNA polymerase activity in vitro.
J Med Chem 39: 4261-74 (1996)
Article DOI: 10.1021/jm950639r
BindingDB Entry DOI: 10.7270/Q2542KSN