BDBM215310 US9296736, 272
SMILES: CCS(=O)(=O)N(C[C@H](C1CC1)N1[C@@H]([C@H](C[C@](C)(CC(O)=O)C1=O)c1cccc(Cl)c1)c1ccc(Cl)cc1)c1ccccc1F
InChI Key: InChIKey=RUKZSEPORBCJMK-DLZIYRPJSA-N
Data: 1 IC50
Activity Spreadsheet -- Enzyme Inhibition Constant Data from BindingDB
Found 1 hit for monomerid = 215310
Trg + Lig
Ki
nM
ΔG°
kcal/mole
IC50
nM
Kd
nM
EC50/IC50
nM
koff
s-1
kon
M-1s-1
pHTemp
°C
MDM2 and p53
(Homo sapiens (Human))
BDBM215310
(US9296736, 272)
Show SMILES CCS(=O)(=O)N(C[C@H](C1CC1)N1[C@@H]([C@H](C[C@](C)(CC(O)=O)C1=O)c1cccc(Cl)c1)c1ccc(Cl)cc1)c1ccccc1F |r|
Show InChI InChI=1S/C33H35Cl2FN2O5S/c1-3-44(42,43)37(28-10-5-4-9-27(28)36)20-29(21-11-12-21)38-31(22-13-15-24(34)16-14-22)26(23-7-6-8-25(35)17-23)18-33(2,32(38)41)19-30(39)40/h4-10,13-17,21,26,29,31H,3,11-12,18-20H2,1-2H3,(H,39,40)/t26-,29-,31-,33-/m1/s1
US Patent
n/an/a 0.100n/an/an/an/a7.425
Amgen INC.
US Patent
Assay Description
The standard assay conditions for the in vitro HTRF assay consisted of a 50 ul total reaction volume in black 384-well Costar polypropylene plates in...
US Patent US9296736 (2016)
BindingDB Entry DOI: 10.7270/Q29022M2