BDBM215340 US9296736, 308::US9593129, Example 308
SMILES: CC[C@@H](CS(=O)(=O)CC1(C)COC1)N1[C@@H]([C@H](C[C@](C)(CC(O)=O)C1=O)c1cccc(Cl)c1)c1ccc(Cl)cc1
InChI Key: InChIKey=MSTLRBWRPAEOIQ-NANZAVOOSA-N
Data: 2 IC50
Activity Spreadsheet -- Enzyme Inhibition Constant Data from BindingDB
Found 2 hits for monomerid = 215340
Trg + Lig
Ki
nM
ΔG°
kcal/mole
IC50
nM
Kd
nM
EC50/IC50
nM
koff
s-1
kon
M-1s-1
pHTemp
°C
E3 ubiquitin-protein ligase Mdm2 (aa 1-188)
(Homo sapiens (Human))
BDBM215340
(US9296736, 308 | US9593129, Example 308)
Show SMILES CC[C@@H](CS(=O)(=O)CC1(C)COC1)N1[C@@H]([C@H](C[C@](C)(CC(O)=O)C1=O)c1cccc(Cl)c1)c1ccc(Cl)cc1
Show InChI InChI=1S/C29H35Cl2NO6S/c1-4-23(15-39(36,37)18-28(2)16-38-17-28)32-26(19-8-10-21(30)11-9-19)24(20-6-5-7-22(31)12-20)13-29(3,27(32)35)14-25(33)34/h5-12,23-24,26H,4,13-18H2,1-3H3,(H,33,34)/t23-,24+,26+,29+/m0/s1
US Patent
n/an/a 0.100n/an/an/an/an/an/a
Amgen, Inc.
US Patent
Assay Description
The standard assay conditions for the in vitro HTRF assay consisted of a 50 ul total reaction volume in black 384-well Costar polypropylene plates in...
US Patent US9593129 (2017)
BindingDB Entry DOI: 10.7270/Q20P1232
MDM2 and p53
(Homo sapiens (Human))
BDBM215340
(US9296736, 308 | US9593129, Example 308)
Show SMILES CC[C@@H](CS(=O)(=O)CC1(C)COC1)N1[C@@H]([C@H](C[C@](C)(CC(O)=O)C1=O)c1cccc(Cl)c1)c1ccc(Cl)cc1
Show InChI InChI=1S/C29H35Cl2NO6S/c1-4-23(15-39(36,37)18-28(2)16-38-17-28)32-26(19-8-10-21(30)11-9-19)24(20-6-5-7-22(31)12-20)13-29(3,27(32)35)14-25(33)34/h5-12,23-24,26H,4,13-18H2,1-3H3,(H,33,34)/t23-,24+,26+,29+/m0/s1
US Patent
n/an/a 0.100n/an/an/an/a7.425
Amgen INC.
US Patent
Assay Description
The standard assay conditions for the in vitro HTRF assay consisted of a 50 ul total reaction volume in black 384-well Costar polypropylene plates in...
US Patent US9296736 (2016)
BindingDB Entry DOI: 10.7270/Q29022M2