BDBM215366 US9296736, 334::US9593129, Example 334
SMILES: CC[C@]1(CC(O)=O)C[C@@H]([C@H](N([C@H](CS(=O)(=O)C2CCCCC2)C2CC2)C1=O)c1ccc(Cl)cc1)c1cccc(Cl)c1
InChI Key: InChIKey=ZWKAIQUQBLRDCO-XDFGCPGZSA-N
Data: 2 IC50
Activity Spreadsheet -- Enzyme Inhibition Constant Data from BindingDB
Found 2 hits for monomerid = 215366
Trg + Lig
Ki
nM
ΔG°
kcal/mole
IC50
nM
Kd
nM
EC50/IC50
nM
koff
s-1
kon
M-1s-1
pHTemp
°C
E3 ubiquitin-protein ligase Mdm2 (aa 1-188)
(Homo sapiens (Human))
BDBM215366
(US9296736, 334 | US9593129, Example 334)
Show SMILES CC[C@]1(CC(O)=O)C[C@@H]([C@H](N([C@H](CS(=O)(=O)C2CCCCC2)C2CC2)C1=O)c1ccc(Cl)cc1)c1cccc(Cl)c1
Show InChI InChI=1S/C32H39Cl2NO5S/c1-2-32(19-29(36)37)18-27(23-7-6-8-25(34)17-23)30(22-13-15-24(33)16-14-22)35(31(32)38)28(21-11-12-21)20-41(39,40)26-9-4-3-5-10-26/h6-8,13-17,21,26-28,30H,2-5,9-12,18-20H2,1H3,(H,36,37)/t27-,28-,30-,32-/m1/s1
US Patent
n/an/a 0.100n/an/an/an/an/an/a
Amgen, Inc.
US Patent
Assay Description
The standard assay conditions for the in vitro HTRF assay consisted of a 50 ul total reaction volume in black 384-well Costar polypropylene plates in...
US Patent US9593129 (2017)
BindingDB Entry DOI: 10.7270/Q20P1232
MDM2 and p53
(Homo sapiens (Human))
BDBM215366
(US9296736, 334 | US9593129, Example 334)
Show SMILES CC[C@]1(CC(O)=O)C[C@@H]([C@H](N([C@H](CS(=O)(=O)C2CCCCC2)C2CC2)C1=O)c1ccc(Cl)cc1)c1cccc(Cl)c1
Show InChI InChI=1S/C32H39Cl2NO5S/c1-2-32(19-29(36)37)18-27(23-7-6-8-25(34)17-23)30(22-13-15-24(33)16-14-22)35(31(32)38)28(21-11-12-21)20-41(39,40)26-9-4-3-5-10-26/h6-8,13-17,21,26-28,30H,2-5,9-12,18-20H2,1H3,(H,36,37)/t27-,28-,30-,32-/m1/s1
US Patent
n/an/a 0.100n/an/an/an/a7.425
Amgen INC.
US Patent
Assay Description
The standard assay conditions for the in vitro HTRF assay consisted of a 50 ul total reaction volume in black 384-well Costar polypropylene plates in...
US Patent US9296736 (2016)
BindingDB Entry DOI: 10.7270/Q29022M2