BDBM215379 US9296736, 358::US9593129, Example 358
SMILES: CC[C@]1(CC(O)=O)C[C@@H]([C@H](N([C@H](CS(=O)(=O)C(C)C)C2CC2)C1=O)c1ccc(Cl)cc1)c1cccc(Cl)c1
InChI Key: InChIKey=QDAHLZVJWDZCJO-GCMXZSHTSA-N
Data: 2 IC50
Activity Spreadsheet -- Enzyme Inhibition Constant Data from BindingDB
Found 2 hits for monomerid = 215379
Trg + Lig
Ki
nM
ΔG°
kcal/mole
IC50
nM
Kd
nM
EC50/IC50
nM
koff
s-1
kon
M-1s-1
pHTemp
°C
E3 ubiquitin-protein ligase Mdm2 (aa 1-188)
(Homo sapiens (Human))
BDBM215379
(US9296736, 358 | US9593129, Example 358)
Show SMILES CC[C@]1(CC(O)=O)C[C@@H]([C@H](N([C@H](CS(=O)(=O)C(C)C)C2CC2)C1=O)c1ccc(Cl)cc1)c1cccc(Cl)c1
Show InChI InChI=1S/C29H35Cl2NO5S/c1-4-29(16-26(33)34)15-24(21-6-5-7-23(31)14-21)27(20-10-12-22(30)13-11-20)32(28(29)35)25(19-8-9-19)17-38(36,37)18(2)3/h5-7,10-14,18-19,24-25,27H,4,8-9,15-17H2,1-3H3,(H,33,34)/t24-,25-,27-,29-/m1/s1
US Patent
n/an/a 0.100n/an/an/an/an/an/a
Amgen, Inc.
US Patent
Assay Description
The standard assay conditions for the in vitro HTRF assay consisted of a 50 ul total reaction volume in black 384-well Costar polypropylene plates in...
US Patent US9593129 (2017)
BindingDB Entry DOI: 10.7270/Q20P1232
MDM2 and p53
(Homo sapiens (Human))
BDBM215379
(US9296736, 358 | US9593129, Example 358)
Show SMILES CC[C@]1(CC(O)=O)C[C@@H]([C@H](N([C@H](CS(=O)(=O)C(C)C)C2CC2)C1=O)c1ccc(Cl)cc1)c1cccc(Cl)c1
Show InChI InChI=1S/C29H35Cl2NO5S/c1-4-29(16-26(33)34)15-24(21-6-5-7-23(31)14-21)27(20-10-12-22(30)13-11-20)32(28(29)35)25(19-8-9-19)17-38(36,37)18(2)3/h5-7,10-14,18-19,24-25,27H,4,8-9,15-17H2,1-3H3,(H,33,34)/t24-,25-,27-,29-/m1/s1
US Patent
n/an/a 0.100n/an/an/an/a7.425
Amgen INC.
US Patent
Assay Description
The standard assay conditions for the in vitro HTRF assay consisted of a 50 ul total reaction volume in black 384-well Costar polypropylene plates in...
US Patent US9296736 (2016)
BindingDB Entry DOI: 10.7270/Q29022M2