BDBM215380 US9296736, 359::US9593129, Example 359
SMILES: CC[C@]1(CC(O)=O)C[C@@H]([C@H](N([C@H](CS(=O)(=O)C(C)(C)C)C2CC2)C1=O)c1ccc(Cl)cc1)c1cccc(Cl)c1
InChI Key: InChIKey=ACFSPISAHLUOQM-QNYAKKFESA-N
Data: 2 IC50
Activity Spreadsheet -- Enzyme Inhibition Constant Data from BindingDB
Found 2 hits for monomerid = 215380
Trg + Lig
Ki
nM
ΔG°
kcal/mole
IC50
nM
Kd
nM
EC50/IC50
nM
koff
s-1
kon
M-1s-1
pHTemp
°C
E3 ubiquitin-protein ligase Mdm2 [1-188]
(Homo sapiens (Human))
BDBM215380
(US9296736, 359 | US9593129, Example 359)
Show SMILES CC[C@]1(CC(O)=O)C[C@@H]([C@H](N([C@H](CS(=O)(=O)C(C)(C)C)C2CC2)C1=O)c1ccc(Cl)cc1)c1cccc(Cl)c1
Show InChI InChI=1S/C30H37Cl2NO5S/c1-5-30(17-26(34)35)16-24(21-7-6-8-23(32)15-21)27(20-11-13-22(31)14-12-20)33(28(30)36)25(19-9-10-19)18-39(37,38)29(2,3)4/h6-8,11-15,19,24-25,27H,5,9-10,16-18H2,1-4H3,(H,34,35)/t24-,25-,27-,30-/m1/s1
US Patent
n/an/a 0.200n/an/an/an/an/an/a
Amgen, Inc.
US Patent
Assay Description
The standard assay conditions for the in vitro HTRF assay consisted of a 50 ul total reaction volume in black 384-well Costar polypropylene plates in...
US Patent US9593129 (2017)
BindingDB Entry DOI: 10.7270/Q20P1232
Cellular tumor antigen p53 [1-83]/E3 ubiquitin-protein ligase Mdm2 [1-188]
(Homo sapiens (Human))
BDBM215380
(US9296736, 359 | US9593129, Example 359)
Show SMILES CC[C@]1(CC(O)=O)C[C@@H]([C@H](N([C@H](CS(=O)(=O)C(C)(C)C)C2CC2)C1=O)c1ccc(Cl)cc1)c1cccc(Cl)c1
Show InChI InChI=1S/C30H37Cl2NO5S/c1-5-30(17-26(34)35)16-24(21-7-6-8-23(32)15-21)27(20-11-13-22(31)14-12-20)33(28(30)36)25(19-9-10-19)18-39(37,38)29(2,3)4/h6-8,11-15,19,24-25,27H,5,9-10,16-18H2,1-4H3,(H,34,35)/t24-,25-,27-,30-/m1/s1
US Patent
n/an/a 0.200n/an/an/an/a7.425
Amgen INC.
US Patent
Assay Description
The standard assay conditions for the in vitro HTRF assay consisted of a 50 ul total reaction volume in black 384-well Costar polypropylene plates in...
US Patent US9296736 (2016)
BindingDB Entry DOI: 10.7270/Q29022M2