BDBM2157 3-[2-(2-chloro-3-ethoxy-6-fluorophenyl)ethyl]-1-(5-chloropyridin-2-yl)thiourea::LY300046HCl Analog 11::N-[2-(2-Chloro-3-ethoxy-6-fluorophenethyl)]-N-[2-(5-chloropyridyl)]thiourea::PETT deriv.
SMILES: CCOc1ccc(F)c(CCNC(=S)Nc2ccc(Cl)cn2)c1Cl
InChI Key: InChIKey=NIINQTIUVDCATJ-UHFFFAOYSA-N
Data: 3 IC50
Activity Spreadsheet -- Enzyme Inhibition Constant Data from BindingDB
Found 3 hits for monomerid = 2157
Trg + Lig
Ki
nM
ΔG°
kcal/mole
IC50
nM
Kd
nM
EC50/IC50
nM
koff
s-1
kon
M-1s-1
pHTemp
°C
HIV-1 Reverse Transcriptase
(Human immunodeficiency virus type 1)
BDBM2157
(3-[2-(2-chloro-3-ethoxy-6-fluorophenyl)ethyl]-1-(5...)
Show SMILES CCOc1ccc(F)c(CCNC(=S)Nc2ccc(Cl)cn2)c1Cl
Show InChI InChI=1S/C16H16Cl2FN3OS/c1-2-23-13-5-4-12(19)11(15(13)18)7-8-20-16(24)22-14-6-3-10(17)9-21-14/h3-6,9H,2,7-8H2,1H3,(H2,20,21,22,24)
n/an/a 6n/an/an/an/an/an/a
Lilly Research Laboratories
Assay Description
The IC50 of reverse transcriptase is the concentration that inhibits 50% of recombinant HIV-1 RT RNA-directed DNA polymerase activity in vitro.
J Med Chem 39: 4261-74 (1996)
Article DOI: 10.1021/jm950639r
BindingDB Entry DOI: 10.7270/Q2542KSN
HIV-1 Reverse Transcriptase Mutant (Y181C)
(Human immunodeficiency virus type 1)
BDBM2157
(3-[2-(2-chloro-3-ethoxy-6-fluorophenyl)ethyl]-1-(5...)
Show SMILES CCOc1ccc(F)c(CCNC(=S)Nc2ccc(Cl)cn2)c1Cl
Show InChI InChI=1S/C16H16Cl2FN3OS/c1-2-23-13-5-4-12(19)11(15(13)18)7-8-20-16(24)22-14-6-3-10(17)9-21-14/h3-6,9H,2,7-8H2,1H3,(H2,20,21,22,24)
n/an/a 30n/an/an/an/an/an/a
Lilly Research Laboratories
Assay Description
The IC50 of reverse transcriptase is the concentration that inhibits 50% of recombinant HIV-1 RT RNA-directed DNA polymerase activity in vitro.
J Med Chem 39: 4261-74 (1996)
Article DOI: 10.1021/jm950639r
BindingDB Entry DOI: 10.7270/Q2542KSN
HIV-1 Reverse Transcriptase Mutant (L100I)
(Human immunodeficiency virus type 1)
BDBM2157
(3-[2-(2-chloro-3-ethoxy-6-fluorophenyl)ethyl]-1-(5...)
Show SMILES CCOc1ccc(F)c(CCNC(=S)Nc2ccc(Cl)cn2)c1Cl
Show InChI InChI=1S/C16H16Cl2FN3OS/c1-2-23-13-5-4-12(19)11(15(13)18)7-8-20-16(24)22-14-6-3-10(17)9-21-14/h3-6,9H,2,7-8H2,1H3,(H2,20,21,22,24)
n/an/a 130n/an/an/an/an/an/a
Lilly Research Laboratories
Assay Description
The IC50 of reverse transcriptase is the concentration that inhibits 50% of recombinant HIV-1 RT RNA-directed DNA polymerase activity in vitro.
J Med Chem 39: 4261-74 (1996)
Article DOI: 10.1021/jm950639r
BindingDB Entry DOI: 10.7270/Q2542KSN