BDBM21579 2-{5-chloro-1'-[(5-chloro-2-fluorophenyl)methyl]-1,2-dihydrospiro[indole-3,3'-pyrrolidine]-2,2',5'-trione}acetic acid::Spiro-indolinone analogue, 71
SMILES: OC(=O)CN1C(=O)C2(CC(=O)N(Cc3cc(Cl)ccc3F)C2=O)c2cc(Cl)ccc12
InChI Key: InChIKey=IXKFWNVFUXXEFY-UHFFFAOYSA-N
Data: 1 KI  1 EC50
Activity Spreadsheet -- Enzyme Inhibition Constant Data from BindingDB
Found 1 hit for monomerid = 21579
Trg + Lig
Ki
nM
ΔG°
kcal/mole
IC50
nM
Kd
nM
EC50/IC50
nM
koff
s-1
kon
M-1s-1
pHTemp
°C
G protein-coupled receptor 44
(Homo sapiens (Human))
BDBM21579
(2-{5-chloro-1'-[(5-chloro-2-fluorophenyl)methyl]-1...)
Show SMILES OC(=O)CN1C(=O)C2(CC(=O)N(Cc3cc(Cl)ccc3F)C2=O)c2cc(Cl)ccc12
Show InChI InChI=1S/C20H13Cl2FN2O5/c21-11-1-3-14(23)10(5-11)8-25-16(26)7-20(19(25)30)13-6-12(22)2-4-15(13)24(18(20)29)9-17(27)28/h1-6H,7-9H2,(H,27,28)
Reactome pathway
10n/an/an/a 48n/an/an/an/a
Merck Serono
Assay Description
A scintillation proximity assay was used for radioligand competition and saturation binding assays. Nonspecific binding was determined in the presenc...
J Med Chem 51: 2227-2243 (2008)
Article DOI: 10.1021/jm701383e
BindingDB Entry DOI: 10.7270/Q22R3PZS