BDBM21595 2-{5-chloro-1'-[(3-methyl-5-phenyl-1,2-oxazol-4-yl)methyl]-1,2-dihydrospiro[indole-3,3'-pyrrolidine]-2,2',5'-trione}acetic acid::Spiro-indolinone analogue, 87
SMILES: Cc1noc(c1CN1C(=O)CC2(C1=O)C(=O)N(CC(O)=O)c1ccc(Cl)cc21)-c1ccccc1
InChI Key: InChIKey=LXGNNQDDJMZRPP-UHFFFAOYSA-N
Data: 1 KI  1 EC50
Activity Spreadsheet -- Enzyme Inhibition Constant Data from BindingDB
Found 1 hit for monomerid = 21595
Trg + Lig
Ki
nM
ΔG°
kcal/mole
IC50
nM
Kd
nM
EC50/IC50
nM
koff
s-1
kon
M-1s-1
pHTemp
°C
G protein-coupled receptor 44
(Homo sapiens (Human))
BDBM21595
(2-{5-chloro-1'-[(3-methyl-5-phenyl-1,2-oxazol-4-yl...)
Show SMILES Cc1noc(c1CN1C(=O)CC2(C1=O)C(=O)N(CC(O)=O)c1ccc(Cl)cc21)-c1ccccc1
Show InChI InChI=1S/C24H18ClN3O6/c1-13-16(21(34-26-13)14-5-3-2-4-6-14)11-28-19(29)10-24(23(28)33)17-9-15(25)7-8-18(17)27(22(24)32)12-20(30)31/h2-9H,10-12H2,1H3,(H,30,31)
Reactome pathway
5.30n/an/an/a 23n/an/an/an/a
Merck Serono
Assay Description
A scintillation proximity assay was used for radioligand competition and saturation binding assays. Nonspecific binding was determined in the presenc...
J Med Chem 51: 2227-2243 (2008)
Article DOI: 10.1021/jm701383e
BindingDB Entry DOI: 10.7270/Q22R3PZS