BDBM21671 N-[4-(2,2,2-trifluoro-1-hydroxy-1-phenylethyl)phenyl]-N-(2,2,2-trifluoroethyl)benzenesulfonamide::T0901317 analogue, 10
SMILES: OC(c1ccccc1)(c1ccc(cc1)N(CC(F)(F)F)S(=O)(=O)c1ccccc1)C(F)(F)F
InChI Key: InChIKey=IWYOSSYNDBCVIR-UHFFFAOYSA-N
Data: 1 IC50  1 EC50
Activity Spreadsheet -- Enzyme Inhibition Constant Data from BindingDB
Found 1 hit for monomerid = 21671
Trg + Lig
Ki
nM
ΔG°
kcal/mole
IC50
nM
Kd
nM
EC50/IC50
nM
koff
s-1
kon
M-1s-1
pHTemp
°C
Pregnane X receptor
(Homo sapiens (Human))
BDBM21671
(N-[4-(2,2,2-trifluoro-1-hydroxy-1-phenylethyl)phen...)
Show SMILES OC(c1ccccc1)(c1ccc(cc1)N(CC(F)(F)F)S(=O)(=O)c1ccccc1)C(F)(F)F
Show InChI InChI=1S/C22H17F6NO3S/c23-20(24,25)15-29(33(31,32)19-9-5-2-6-10-19)18-13-11-17(12-14-18)21(30,22(26,27)28)16-7-3-1-4-8-16/h1-14,30H,15H2
n/an/a 63n/a 16n/an/a8.022
University of North Carolina at Chapel Hill
Assay Description
Polylysine YiO imaging beads (Amersham, GE Healthcare) were coated with histidine-tagged WT PXR LBD. Nonspecific binding sites were blocked with BSA....
Bioorg Med Chem 15: 2156-66 (2007)
Article DOI: 10.1016/j.bmc.2006.12.026
BindingDB Entry DOI: 10.7270/Q2PG1Q15