BDBM21693 1-(2-chlorophenyl)-3-[1-methyl-3-oxo-2-phenyl-5-(propan-2-yl)-2,3-dihydro-1H-pyrazol-4-yl]urea::1-(2-chlorophenyl)-3-[1-methyl-5-(1-methylethyl)-3-oxo-2-phenyl-2,3-dihydro-1H-pyrazol-4-yl]urea::CHEMBL377169::Pyrazolone, 2
SMILES: CC(C)c1c(NC(=O)Nc2ccccc2Cl)c(=O)n(-c2ccccc2)n1C
InChI Key: InChIKey=NYMNKQKVDUIVME-UHFFFAOYSA-N
Data: 2 EC50
Activity Spreadsheet -- Enzyme Inhibition Constant Data from BindingDB
Found 2 hits for monomerid = 21693
Trg + Lig
Ki
nM
ΔG°
kcal/mole
IC50
nM
Kd
nM
EC50/IC50
nM
koff
s-1
kon
M-1s-1
pHTemp
°C
N-formyl peptide receptor 2
(Homo sapiens (Human))
BDBM21693
(1-(2-chlorophenyl)-3-[1-methyl-3-oxo-2-phenyl-5-(p...)
Show SMILES CC(C)c1c(NC(=O)Nc2ccccc2Cl)c(=O)n(-c2ccccc2)n1C
Show InChI InChI=1S/C20H21ClN4O2/c1-13(2)18-17(23-20(27)22-16-12-8-7-11-15(16)21)19(26)25(24(18)3)14-9-5-4-6-10-14/h4-13H,1-3H3,(H2,22,23,27)
NCI pathway
Reactome pathway
n/an/an/an/a>1.00E+4n/an/an/an/a
Amgen, Inc.
Curated by ChEMBL
Assay Description
Activity at human FPRL1-mediated calcium mobilization in CHO cells
Bioorg Med Chem Lett 16: 3713-8 (2006)
Article DOI: 10.1016/j.bmcl.2006.04.068
BindingDB Entry DOI: 10.7270/Q2DF6QTJ
N-formyl peptide receptor 2
(Homo sapiens (Human))
BDBM21693
(1-(2-chlorophenyl)-3-[1-methyl-3-oxo-2-phenyl-5-(p...)
Show SMILES CC(C)c1c(NC(=O)Nc2ccccc2Cl)c(=O)n(-c2ccccc2)n1C
Show InChI InChI=1S/C20H21ClN4O2/c1-13(2)18-17(23-20(27)22-16-12-8-7-11-15(16)21)19(26)25(24(18)3)14-9-5-4-6-10-14/h4-13H,1-3H3,(H2,22,23,27)
NCI pathway
Reactome pathway
n/an/an/an/a>1.00E+4n/an/a7.237
Amgen
Assay Description
hFPRL 1 activity was assayed using an aequorin-based bioluminescence assay (Ca2+ flux). EC50 values have been determined by Ca2+ flux in CHO recombin...
Bioorg Med Chem Lett 17: 6633-7 (2007)
Article DOI: 10.1016/j.bmcl.2007.09.043
BindingDB Entry DOI: 10.7270/Q25H7DJ4