BDBM217089 US9302989, 384
SMILES: O=C(Nc1ccc(cc1)-c1c[nH]c(=O)c2ccccc12)N1Cc2ccc(cc2C1)C#N
InChI Key: InChIKey=OBYJQKZNRUOYGF-UHFFFAOYSA-N
Data: 1 KI  2 IC50
Activity Spreadsheet -- Enzyme Inhibition Constant Data from BindingDB
Found 3 hits for monomerid = 217089
Trg + Lig
Ki
nM
ΔG°
kcal/mole
IC50
nM
Kd
nM
EC50/IC50
nM
koff
s-1
kon
M-1s-1
pHTemp
°C
Rho-associated protein kinase 2
(Homo sapiens (Human))
BDBM217089
(US9302989, 384)
Show SMILES O=C(Nc1ccc(cc1)-c1c[nH]c(=O)c2ccccc12)N1Cc2ccc(cc2C1)C#N
Show InChI InChI=1S/C25H18N4O2/c26-12-16-5-6-18-14-29(15-19(18)11-16)25(31)28-20-9-7-17(8-10-20)23-13-27-24(30)22-4-2-1-3-21(22)23/h1-11,13H,14-15H2,(H,27,30)(H,28,31)
US Patent
4.24n/an/an/an/an/an/an/an/a
AbbVie Inc.
US Patent
Assay Description
HTRF assay: This assay used the CisBio HTRF KinEASE kit (kit 62ST2PEZ) and the kinase reaction containing 0.2 uM biotinylated substrate peptide (S2, ...
US Patent US9302989 (2016)
BindingDB Entry DOI: 10.7270/Q2HH6HX1
Nicotinamide phosphoribosyltransferase
(Homo sapiens (Human))
BDBM217089
(US9302989, 384)
Show SMILES O=C(Nc1ccc(cc1)-c1c[nH]c(=O)c2ccccc12)N1Cc2ccc(cc2C1)C#N
Show InChI InChI=1S/C25H18N4O2/c26-12-16-5-6-18-14-29(15-19(18)11-16)25(31)28-20-9-7-17(8-10-20)23-13-27-24(30)22-4-2-1-3-21(22)23/h1-11,13H,14-15H2,(H,27,30)(H,28,31)
Reactome pathway
US Patent
n/an/a 9.74n/an/an/an/a7.5n/a
AbbVie Inc.
US Patent
Assay Description
Probe 1:The assay was carried out in 18 uL low volume plates (Owens Corning) in reaction buffer (50 mM HEPES (NaOH), pH 7.5, 100 mM NaCl, 10 mM MgCl2...
US Patent US9302989 (2016)
BindingDB Entry DOI: 10.7270/Q2HH6HX1
Nicotinamide phosphoribosyltransferase
(Homo sapiens (Human))
BDBM217089
(US9302989, 384)
Show SMILES O=C(Nc1ccc(cc1)-c1c[nH]c(=O)c2ccccc12)N1Cc2ccc(cc2C1)C#N
Show InChI InChI=1S/C25H18N4O2/c26-12-16-5-6-18-14-29(15-19(18)11-16)25(31)28-20-9-7-17(8-10-20)23-13-27-24(30)22-4-2-1-3-21(22)23/h1-11,13H,14-15H2,(H,27,30)(H,28,31)
Reactome pathway
US Patent
n/an/a 8.89n/an/an/an/a7.5n/a
AbbVie Inc.
US Patent
Assay Description
Probe 2:The assay was carried out in 18 uL low volume plates (Owens Corning) in reaction buffer (50 mM HEPES (NaOH), pH 7.5, 100 mM NaCl, 10 mM MgCl2...
US Patent US9302989 (2016)
BindingDB Entry DOI: 10.7270/Q2HH6HX1