BDBM21713 3-[(2-chloro-4-{[3-(2,6-dichlorophenyl)-5-(propan-2-yl)-1,2-oxazol-4-yl]methoxy}benzene)(methyl)amido]benzoic acid::Isoxazole derivative, 15b
SMILES: CC(C)c1onc(c1COc1ccc(C(=O)N(C)c2cccc(c2)C(O)=O)c(Cl)c1)-c1c(Cl)cccc1Cl
InChI Key: InChIKey=OQAKDJLSFYPIPF-UHFFFAOYSA-N
Data: 2 EC50
Activity Spreadsheet -- Enzyme Inhibition Constant Data from BindingDB
Found 2 hits for monomerid = 21713
Trg + Lig
Ki
nM
ΔG°
kcal/mole
IC50
nM
Kd
nM
EC50/IC50
nM
koff
s-1
kon
M-1s-1
pHTemp
°C
Bile acid receptor
(Homo sapiens (Human))
BDBM21713
(3-[(2-chloro-4-{[3-(2,6-dichlorophenyl)-5-(propan-...)
Show SMILES CC(C)c1onc(c1COc1ccc(C(=O)N(C)c2cccc(c2)C(O)=O)c(Cl)c1)-c1c(Cl)cccc1Cl |(-.47,5.13,;-.79,3.62,;.35,2.59,;-2.25,3.15,;-3.5,4.05,;-4.75,3.15,;-4.27,1.68,;-2.73,1.68,;-1.82,.44,;-.29,.6,;.61,-.65,;1.95,.12,;3.28,-.65,;3.28,-2.19,;4.61,-2.96,;4.61,-4.5,;5.95,-2.19,;5.95,-.65,;7.28,-2.96,;7.28,-4.5,;8.61,-5.27,;9.95,-4.5,;9.95,-2.96,;8.61,-2.19,;11.28,-2.19,;12.61,-2.96,;11.28,-.65,;1.95,-2.96,;1.95,-4.5,;.61,-2.19,;-5.18,.44,;-6.65,.88,;-7,2.38,;-7.77,-.17,;-7.42,-1.67,;-5.95,-2.12,;-4.82,-1.06,;-3.35,-1.51,)|
Show InChI InChI=1S/C28H23Cl3N2O5/c1-15(2)26-20(25(32-38-26)24-21(29)8-5-9-22(24)30)14-37-18-10-11-19(23(31)13-18)27(34)33(3)17-7-4-6-16(12-17)28(35)36/h4-13,15H,14H2,1-3H3,(H,35,36)
NCI pathway
Reactome pathway
n/an/an/an/a 3.10E+3n/an/an/an/a
The University of Tokyo
Curated by ChEMBL
Assay Description
Agonist activity at human recombinant FXR expressed in HEK293 cells coexpressing CMX-GAL4N by luciferase reporter gene assay
Bioorg Med Chem Lett 22: 3962-6 (2012)
Article DOI: 10.1016/j.bmcl.2012.04.099
BindingDB Entry DOI: 10.7270/Q25X29X2
Bile acid receptor
(Homo sapiens (Human))
BDBM21713
(3-[(2-chloro-4-{[3-(2,6-dichlorophenyl)-5-(propan-...)
Show SMILES CC(C)c1onc(c1COc1ccc(C(=O)N(C)c2cccc(c2)C(O)=O)c(Cl)c1)-c1c(Cl)cccc1Cl |(-.47,5.13,;-.79,3.62,;.35,2.59,;-2.25,3.15,;-3.5,4.05,;-4.75,3.15,;-4.27,1.68,;-2.73,1.68,;-1.82,.44,;-.29,.6,;.61,-.65,;1.95,.12,;3.28,-.65,;3.28,-2.19,;4.61,-2.96,;4.61,-4.5,;5.95,-2.19,;5.95,-.65,;7.28,-2.96,;7.28,-4.5,;8.61,-5.27,;9.95,-4.5,;9.95,-2.96,;8.61,-2.19,;11.28,-2.19,;12.61,-2.96,;11.28,-.65,;1.95,-2.96,;1.95,-4.5,;.61,-2.19,;-5.18,.44,;-6.65,.88,;-7,2.38,;-7.77,-.17,;-7.42,-1.67,;-5.95,-2.12,;-4.82,-1.06,;-3.35,-1.51,)|
Show InChI InChI=1S/C28H23Cl3N2O5/c1-15(2)26-20(25(32-38-26)24-21(29)8-5-9-22(24)30)14-37-18-10-11-19(23(31)13-18)27(34)33(3)17-7-4-6-16(12-17)28(35)36/h4-13,15H,14H2,1-3H3,(H,35,36)
NCI pathway
Reactome pathway
n/an/an/an/a 3.10E+3n/an/a7.237
University of Tokyo
Assay Description
Compounds were screened for agonist/antagonist activity on FXR-GAL4 chimeric receptors in transiently transfected HEK-293 cells. The EC50/IC50 values...
Bioorg Med Chem 15: 2587-600 (2007)
Article DOI: 10.1016/j.bmc.2007.01.046
BindingDB Entry DOI: 10.7270/Q21R6NSZ