BDBM217157 US9302989, 574
SMILES: CC(C)CCNC(=O)c1ccc(NC(=O)N2Cc3ccccc3C2)cn1
InChI Key: InChIKey=DBKYNAIPHBZCGN-UHFFFAOYSA-N
Data: 1 KI  2 IC50
Activity Spreadsheet -- Enzyme Inhibition Constant Data from BindingDB
Found 3 hits for monomerid = 217157
Trg + Lig
Ki
nM
ΔG°
kcal/mole
IC50
nM
Kd
nM
EC50/IC50
nM
koff
s-1
kon
M-1s-1
pHTemp
°C
Nicotinamide phosphoribosyltransferase
(Homo sapiens (Human))
BDBM217157
(US9302989, 574)
Show SMILES CC(C)CCNC(=O)c1ccc(NC(=O)N2Cc3ccccc3C2)cn1
Show InChI InChI=1S/C20H24N4O2/c1-14(2)9-10-21-19(25)18-8-7-17(11-22-18)23-20(26)24-12-15-5-3-4-6-16(15)13-24/h3-8,11,14H,9-10,12-13H2,1-2H3,(H,21,25)(H,23,26)
Reactome pathway
57n/an/an/an/an/an/an/an/a
AbbVie Inc, 1 North Waukegan Rd., North Chicago, IL 60064, United States. Electronic address: mike.curtin@abbvie.com.
Curated by ChEMBL
Assay Description
Inhibition of C-terminal His-tagged human recombinant NAMPT using FK866 or isoindoline urea-based Oregon green (488) probe incubated for 3 hrs by TR-...
Bioorg Med Chem Lett 27: 3317-3325 (2017)
Article DOI: 10.1016/j.bmcl.2017.06.018
BindingDB Entry DOI: 10.7270/Q2D22123
Nicotinamide phosphoribosyltransferase
(Homo sapiens (Human))
BDBM217157
(US9302989, 574)
Show SMILES CC(C)CCNC(=O)c1ccc(NC(=O)N2Cc3ccccc3C2)cn1
Show InChI InChI=1S/C20H24N4O2/c1-14(2)9-10-21-19(25)18-8-7-17(11-22-18)23-20(26)24-12-15-5-3-4-6-16(15)13-24/h3-8,11,14H,9-10,12-13H2,1-2H3,(H,21,25)(H,23,26)
Reactome pathway
US Patent
n/an/a 79.4n/an/an/an/a7.5n/a
AbbVie Inc.
US Patent
Assay Description
Probe 1:The assay was carried out in 18 uL low volume plates (Owens Corning) in reaction buffer (50 mM HEPES (NaOH), pH 7.5, 100 mM NaCl, 10 mM MgCl2...
US Patent US9302989 (2016)
BindingDB Entry DOI: 10.7270/Q2HH6HX1
Nicotinamide phosphoribosyltransferase
(Homo sapiens (Human))
BDBM217157
(US9302989, 574)
Show SMILES CC(C)CCNC(=O)c1ccc(NC(=O)N2Cc3ccccc3C2)cn1
Show InChI InChI=1S/C20H24N4O2/c1-14(2)9-10-21-19(25)18-8-7-17(11-22-18)23-20(26)24-12-15-5-3-4-6-16(15)13-24/h3-8,11,14H,9-10,12-13H2,1-2H3,(H,21,25)(H,23,26)
Reactome pathway
US Patent
n/an/a 62.1n/an/an/an/a7.5n/a
AbbVie Inc.
US Patent
Assay Description
Probe 2:The assay was carried out in 18 uL low volume plates (Owens Corning) in reaction buffer (50 mM HEPES (NaOH), pH 7.5, 100 mM NaCl, 10 mM MgCl2...
US Patent US9302989 (2016)
BindingDB Entry DOI: 10.7270/Q2HH6HX1