BDBM217368 (2R)-2,6-diaminohexanoic acid::D-Lysine
SMILES: NCCCC[C@@H](N)C(O)=O
InChI Key: InChIKey=KDXKERNSBIXSRK-RXMQYKEDSA-N
Data: 1 Kd  1 ITC
PDB links: 128 PDB IDs match this monomer.
Activity Spreadsheet -- Enzyme Inhibition Constant Data from BindingDB
Found 1 hit for monomerid = 217368
Trg + Lig
Ki
nM
ΔG°
kcal/mole
IC50
nM
Kd
nM
EC50/IC50
nM
koff
s-1
kon
M-1s-1
pHTemp
°C
LysP-related transporter STM2200 (STM2200)
(Salmonella typhimurium)
BDBM217368
((2R)-2,6-diaminohexanoic acid | D-Lysine)
Show SMILES NCCCC[C@@H](N)C(O)=O
Show InChI InChI=1S/C6H14N2O2/c7-4-2-1-3-5(8)6(9)10/h5H,1-4,7-8H2,(H,9,10)/t5-/m1/s1
n/an/an/a 1.80E+6n/an/an/a5.920
Max Planck Institute of Biophysics
Assay Description
ITC measurements were carried out at 20 °C with a VP-ITC calorimeter (GE Healthcare, MicroCal, Inc.) consisting of a 1.45-ml reaction cell. STM2200 i...
J Biol Chem 289: 1377-87 (2014)
Article DOI: 10.1074/jbc.M113.510743
BindingDB Entry DOI: 10.7270/Q2M907HX
Activity Spreadsheet -- ITC Data from BindingDB
Found 1 hit for monomerid = 217368
Cell (A)Syringe (B)Cell
Syringe
Cell + Syr
ΔG°
kcal/mole
-TΔS°
kcal/mole
ΔH°
kcal/mole
log KpHTemp
°C
LysP-related transporter STM2200 (STM2200)
(Salmonella typhimurium)
BDBM217368
JPEG
((2R)-2,6-diaminohexanoic acid | D-Lysine)
-3.96-77.01.29n/a5.9020
Max Planck Institute of Biophysics
J Biol Chem 289: 1377-87 (2014)