null
SMILES: Cc1cccc(OCCCOc2ccc3[C@H](CC(O)=O)CCc3c2)c1
InChI Key: InChIKey=NWTGXSVYKLAVJS-KRWDZBQOSA-N
Activity Spreadsheet -- Enzyme Inhibition Constant Data from BindingDB
Found 5 hits for monomerid = 21761
Trg + Lig
Ki
nM
ΔG°
kcal/mole
IC50
nM
Kd
nM
EC50/IC50
nM
koff
s-1
kon
M-1s-1
pHTemp
°C
Peroxisome proliferator-activated receptor alpha
(Homo sapiens (Human))
BDBM21761
(2-[(1S)-5-[3-(3-methylphenoxy)propoxy]-2,3-dihydro...)
Show SMILES Cc1cccc(OCCCOc2ccc3[C@H](CC(O)=O)CCc3c2)c1 |r|
Show InChI InChI=1S/C21H24O4/c1-15-4-2-5-18(12-15)24-10-3-11-25-19-8-9-20-16(13-19)6-7-17(20)14-21(22)23/h2,4-5,8-9,12-13,17H,3,6-7,10-11,14H2,1H3,(H,22,23)/t17-/m0/s1
n/an/an/an/a>1.00E+4n/an/a7.422
Bayer HealthCare Pharmaceuticals Corporation
Assay Description
Activity was assessed by measuring the human PPAR ligand binding domain with the co-activator protein. Europium labeled anti-GST antibody, streptavid...
J Med Chem 50: 984-1000 (2007)
Article DOI: 10.1021/jm061299k
BindingDB Entry DOI: 10.7270/Q2NK3C93
Peroxisome proliferator-activated receptor delta
(Homo sapiens (Human))
BDBM21761
(2-[(1S)-5-[3-(3-methylphenoxy)propoxy]-2,3-dihydro...)
Show SMILES Cc1cccc(OCCCOc2ccc3[C@H](CC(O)=O)CCc3c2)c1 |r|
Show InChI InChI=1S/C21H24O4/c1-15-4-2-5-18(12-15)24-10-3-11-25-19-8-9-20-16(13-19)6-7-17(20)14-21(22)23/h2,4-5,8-9,12-13,17H,3,6-7,10-11,14H2,1H3,(H,22,23)/t17-/m0/s1
n/an/an/an/a 56n/an/an/a25
Bayer HealthCare Pharmaceuticals Corporation
Assay Description
Activity was assessed by measuring the human PPAR ligand binding domain with the co-activator protein. Europium labeled anti-GST antibody, streptavid...
J Med Chem 50: 984-1000 (2007)
Article DOI: 10.1021/jm061299k
BindingDB Entry DOI: 10.7270/Q2NK3C93
Peroxisome proliferator-activated receptor delta
(Homo sapiens (Human))
BDBM21761
(2-[(1S)-5-[3-(3-methylphenoxy)propoxy]-2,3-dihydro...)
Show SMILES Cc1cccc(OCCCOc2ccc3[C@H](CC(O)=O)CCc3c2)c1 |r|
Show InChI InChI=1S/C21H24O4/c1-15-4-2-5-18(12-15)24-10-3-11-25-19-8-9-20-16(13-19)6-7-17(20)14-21(22)23/h2,4-5,8-9,12-13,17H,3,6-7,10-11,14H2,1H3,(H,22,23)/t17-/m0/s1
n/an/an/an/a 1.79E+7n/an/an/an/a
TBA
Assay Description
Agonist activity at GST-tagged Homo sapiens (human) PPARdelta ligand binding domain after 2 hr by FRET assay
Citation and Details
Article DOI: 10.1007/s00044-011-9599-z
BindingDB Entry DOI: 10.7270/Q22J6FR8
Peroxisome proliferator-activated receptor gamma
(Homo sapiens (Human))
BDBM21761
(2-[(1S)-5-[3-(3-methylphenoxy)propoxy]-2,3-dihydro...)
Show SMILES Cc1cccc(OCCCOc2ccc3[C@H](CC(O)=O)CCc3c2)c1 |r|
Show InChI InChI=1S/C21H24O4/c1-15-4-2-5-18(12-15)24-10-3-11-25-19-8-9-20-16(13-19)6-7-17(20)14-21(22)23/h2,4-5,8-9,12-13,17H,3,6-7,10-11,14H2,1H3,(H,22,23)/t17-/m0/s1
NCI pathway
Reactome pathway
n/an/an/an/a 1.26E+5n/an/an/an/a
TBA
Assay Description
Agonist activity at Homo sapiens (human) PPARgamma expressed in mouse 3T3-L1 cells incubated for 2 days followed by compound wash out measured after ...
Citation and Details
Article DOI: 10.1007/s00044-011-9599-z
BindingDB Entry DOI: 10.7270/Q22J6FR8
Peroxisome proliferator-activated receptor gamma
(Homo sapiens (Human))
BDBM21761
(2-[(1S)-5-[3-(3-methylphenoxy)propoxy]-2,3-dihydro...)
Show SMILES Cc1cccc(OCCCOc2ccc3[C@H](CC(O)=O)CCc3c2)c1 |r|
Show InChI InChI=1S/C21H24O4/c1-15-4-2-5-18(12-15)24-10-3-11-25-19-8-9-20-16(13-19)6-7-17(20)14-21(22)23/h2,4-5,8-9,12-13,17H,3,6-7,10-11,14H2,1H3,(H,22,23)/t17-/m0/s1
NCI pathway
Reactome pathway
n/an/an/an/a 8.00E+3n/an/an/a25
Bayer HealthCare Pharmaceuticals Corporation
Assay Description
PPAR gamma activity was assessed by using the IRBA in mouse 3T3-L1 cells. This assay measures the ability of test compound to cause an increase in th...
J Med Chem 50: 984-1000 (2007)
Article DOI: 10.1021/jm061299k
BindingDB Entry DOI: 10.7270/Q2NK3C93