null
SMILES: CC(=O)Nc1cc(ccc1OCCCOc1ccc2[C@H](CC(O)=O)CCc2c1)-n1ccnn1
InChI Key: InChIKey=YYSCULLHLGWVSS-SFHVURJKSA-N
Activity Spreadsheet -- Enzyme Inhibition Constant Data from BindingDB
Found 6 hits for monomerid = 21775
Trg + Lig
Ki
nM
ΔG°
kcal/mole
IC50
nM
Kd
nM
EC50/IC50
nM
koff
s-1
kon
M-1s-1
pHTemp
°C
Peroxisome proliferator-activated receptor alpha
(Homo sapiens (Human))
BDBM21775
(2-[(1S)-5-{3-[2-acetamido-4-(1H-1,2,3-triazol-1-yl...)
Show SMILES CC(=O)Nc1cc(ccc1OCCCOc1ccc2[C@H](CC(O)=O)CCc2c1)-n1ccnn1 |r|
Show InChI InChI=1S/C24H26N4O5/c1-16(29)26-22-15-19(28-10-9-25-27-28)5-8-23(22)33-12-2-11-32-20-6-7-21-17(13-20)3-4-18(21)14-24(30)31/h5-10,13,15,18H,2-4,11-12,14H2,1H3,(H,26,29)(H,30,31)/t18-/m0/s1
n/an/an/an/a 9.20E+3n/an/a7.422
Bayer HealthCare Pharmaceuticals Corporation
Assay Description
Activity was assessed by measuring the human PPAR ligand binding domain with the co-activator protein. Europium labeled anti-GST antibody, streptavid...
J Med Chem 50: 984-1000 (2007)
Article DOI: 10.1021/jm061299k
BindingDB Entry DOI: 10.7270/Q2NK3C93
Peroxisome proliferator-activated receptor delta
(Homo sapiens (Human))
BDBM21775
(2-[(1S)-5-{3-[2-acetamido-4-(1H-1,2,3-triazol-1-yl...)
Show SMILES CC(=O)Nc1cc(ccc1OCCCOc1ccc2[C@H](CC(O)=O)CCc2c1)-n1ccnn1 |r|
Show InChI InChI=1S/C24H26N4O5/c1-16(29)26-22-15-19(28-10-9-25-27-28)5-8-23(22)33-12-2-11-32-20-6-7-21-17(13-20)3-4-18(21)14-24(30)31/h5-10,13,15,18H,2-4,11-12,14H2,1H3,(H,26,29)(H,30,31)/t18-/m0/s1
n/an/an/an/a 367n/an/an/a25
Bayer HealthCare Pharmaceuticals Corporation
Assay Description
Activity was assessed by measuring the human PPAR ligand binding domain with the co-activator protein. Europium labeled anti-GST antibody, streptavid...
J Med Chem 50: 984-1000 (2007)
Article DOI: 10.1021/jm061299k
BindingDB Entry DOI: 10.7270/Q2NK3C93
Peroxisome proliferator-activated receptor gamma
(Homo sapiens (Human))
BDBM21775
(2-[(1S)-5-{3-[2-acetamido-4-(1H-1,2,3-triazol-1-yl...)
Show SMILES CC(=O)Nc1cc(ccc1OCCCOc1ccc2[C@H](CC(O)=O)CCc2c1)-n1ccnn1 |r|
Show InChI InChI=1S/C24H26N4O5/c1-16(29)26-22-15-19(28-10-9-25-27-28)5-8-23(22)33-12-2-11-32-20-6-7-21-17(13-20)3-4-18(21)14-24(30)31/h5-10,13,15,18H,2-4,11-12,14H2,1H3,(H,26,29)(H,30,31)/t18-/m0/s1
NCI pathway
Reactome pathway
n/an/an/an/a 1.82E+5n/an/an/an/a
TBA
Assay Description
Agonist activity at Homo sapiens (human) PPARgamma expressed in mouse 3T3-L1 cells incubated for 2 days followed by compound wash out measured after ...
Citation and Details
Article DOI: 10.1007/s00044-011-9599-z
BindingDB Entry DOI: 10.7270/Q22J6FR8
Peroxisome proliferator-activated receptor delta
(Homo sapiens (Human))
BDBM21775
(2-[(1S)-5-{3-[2-acetamido-4-(1H-1,2,3-triazol-1-yl...)
Show SMILES CC(=O)Nc1cc(ccc1OCCCOc1ccc2[C@H](CC(O)=O)CCc2c1)-n1ccnn1 |r|
Show InChI InChI=1S/C24H26N4O5/c1-16(29)26-22-15-19(28-10-9-25-27-28)5-8-23(22)33-12-2-11-32-20-6-7-21-17(13-20)3-4-18(21)14-24(30)31/h5-10,13,15,18H,2-4,11-12,14H2,1H3,(H,26,29)(H,30,31)/t18-/m0/s1
n/an/an/an/a 2.72E+6n/an/an/an/a
TBA
Assay Description
Agonist activity at GST-tagged Homo sapiens (human) PPARdelta ligand binding domain after 2 hr by FRET assay
Citation and Details
Article DOI: 10.1007/s00044-011-9599-z
BindingDB Entry DOI: 10.7270/Q22J6FR8
Peroxisome proliferator-activated receptor alpha
(Homo sapiens (Human))
BDBM21775
(2-[(1S)-5-{3-[2-acetamido-4-(1H-1,2,3-triazol-1-yl...)
Show SMILES CC(=O)Nc1cc(ccc1OCCCOc1ccc2[C@H](CC(O)=O)CCc2c1)-n1ccnn1 |r|
Show InChI InChI=1S/C24H26N4O5/c1-16(29)26-22-15-19(28-10-9-25-27-28)5-8-23(22)33-12-2-11-32-20-6-7-21-17(13-20)3-4-18(21)14-24(30)31/h5-10,13,15,18H,2-4,11-12,14H2,1H3,(H,26,29)(H,30,31)/t18-/m0/s1
n/an/an/an/a 1.09E+5n/an/an/an/a
TBA
Assay Description
Agonist activity at GST-tagged Homo sapiens (human) PPARalpha ligand binding domain after 2 hr by FRET assay
Citation and Details
Article DOI: 10.1007/s00044-011-9599-z
BindingDB Entry DOI: 10.7270/Q22J6FR8
Peroxisome proliferator-activated receptor gamma
(Homo sapiens (Human))
BDBM21775
(2-[(1S)-5-{3-[2-acetamido-4-(1H-1,2,3-triazol-1-yl...)
Show SMILES CC(=O)Nc1cc(ccc1OCCCOc1ccc2[C@H](CC(O)=O)CCc2c1)-n1ccnn1 |r|
Show InChI InChI=1S/C24H26N4O5/c1-16(29)26-22-15-19(28-10-9-25-27-28)5-8-23(22)33-12-2-11-32-20-6-7-21-17(13-20)3-4-18(21)14-24(30)31/h5-10,13,15,18H,2-4,11-12,14H2,1H3,(H,26,29)(H,30,31)/t18-/m0/s1
NCI pathway
Reactome pathway
n/an/an/an/a 5.60E+3n/an/an/a25
Bayer HealthCare Pharmaceuticals Corporation
Assay Description
PPAR gamma activity was assessed by using the IRBA in mouse 3T3-L1 cells. This assay measures the ability of test compound to cause an increase in th...
J Med Chem 50: 984-1000 (2007)
Article DOI: 10.1021/jm061299k
BindingDB Entry DOI: 10.7270/Q2NK3C93