null
SMILES: CC[C@@H](NC(=O)c1cc(C(=O)N2CCC[C@@H]2C)n2CCOCc12)c1ccc(c(Cl)c1)C(F)(F)F
InChI Key: InChIKey=JCBZELCVZUFNOM-IFXJQAMLSA-N
Activity Spreadsheet -- Enzyme Inhibition Constant Data from BindingDB
Found 2 hits for monomerid = 218253
Trg + Lig
Ki
nM
ΔG°
kcal/mole
IC50
nM
Kd
nM
EC50/IC50
nM
koff
s-1
kon
M-1s-1
pHTemp
°C
Potassium channel subfamily K member 3
(Homo sapiens (Human))
BDBM218253
(US9284333, 16c)
Show SMILES CC[C@@H](NC(=O)c1cc(C(=O)N2CCC[C@@H]2C)n2CCOCc12)c1ccc(c(Cl)c1)C(F)(F)F |r|
Show InChI InChI=1S/C24H27ClF3N3O3/c1-3-19(15-6-7-17(18(25)11-15)24(26,27)28)29-22(32)16-12-20(31-9-10-34-13-21(16)31)23(33)30-8-4-5-14(30)2/h6-7,11-12,14,19H,3-5,8-10,13H2,1-2H3,(H,29,32)/t14-,19+/m0/s1
US Patent
n/an/a 13n/an/an/an/an/a25
Sanofi
US Patent
Assay Description
Human TASK-1 channels were expressed in Xenopus oocytes. For this purpose, oocytes were isolated from Xenopus laevis and defoliculated. Subsequently,...
US Patent US9284333 (2016)
BindingDB Entry DOI: 10.7270/Q2FJ2FMC
Potassium voltage-gated channel subfamily H member 2
(Homo sapiens (Human))
BDBM218253
(US9284333, 16c)
Show SMILES CC[C@@H](NC(=O)c1cc(C(=O)N2CCC[C@@H]2C)n2CCOCc12)c1ccc(c(Cl)c1)C(F)(F)F |r|
Show InChI InChI=1S/C24H27ClF3N3O3/c1-3-19(15-6-7-17(18(25)11-15)24(26,27)28)29-22(32)16-12-20(31-9-10-34-13-21(16)31)23(33)30-8-4-5-14(30)2/h6-7,11-12,14,19H,3-5,8-10,13H2,1-2H3,(H,29,32)/t14-,19+/m0/s1
Reactome pathway
US Patent
n/an/a>1.00E+4n/an/an/an/an/a25
Sanofi
US Patent
Assay Description
The effect of compounds of the formula I on the cloned human cardiac hERG channel was evaluated in an in vitro model using a whole-cell patch-clampin...
US Patent US9284333 (2016)
BindingDB Entry DOI: 10.7270/Q2FJ2FMC