BDBM2184 SM30::US8501787, 166
SMILES: Cc1cccc2nc(c(NC3CCCCC3)n12)-c1ccccc1Cl
InChI Key: InChIKey=FKSAWGDCELGVTE-UHFFFAOYSA-N
Data: 2 IC50
Activity Spreadsheet -- Enzyme Inhibition Constant Data from BindingDB
Found 2 hits for monomerid = 2184
Trg + Lig
Ki
nM
ΔG°
kcal/mole
IC50
nM
Kd
nM
EC50/IC50
nM
koff
s-1
kon
M-1s-1
pHTemp
°C
Reverse transcriptase
(Human immunodeficiency virus 1)
BDBM2184
(SM30 | US8501787, 166)
Show SMILES Cc1cccc2nc(c(NC3CCCCC3)n12)-c1ccccc1Cl
Show InChI InChI=1S/C20H22ClN3/c1-14-8-7-13-18-23-19(16-11-5-6-12-17(16)21)20(24(14)18)22-15-9-3-2-4-10-15/h5-8,11-13,15,22H,2-4,9-10H2,1H3
n/an/a 1.55E+3n/an/an/an/an/an/a
CSIR Biosciences
Curated by ChEMBL
Assay Description
Inhibition of HIV1 reverse transcriptase assessed as residual enzyme activity at 50 uM after 1 hr by ELISA
Bioorg Med Chem 19: 4227-37 (2011)
Article DOI: 10.1016/j.bmc.2011.05.062
BindingDB Entry DOI: 10.7270/Q29K4F22
Reverse transcriptase protein
(Human immunodeficiency virus 1)
BDBM2184
(SM30 | US8501787, 166)
Show SMILES Cc1cccc2nc(c(NC3CCCCC3)n12)-c1ccccc1Cl
Show InChI InChI=1S/C20H22ClN3/c1-14-8-7-13-18-23-19(16-11-5-6-12-17(16)21)20(24(14)18)22-15-9-3-2-4-10-15/h5-8,11-13,15,22H,2-4,9-10H2,1H3
US Patent
n/an/a 1.55E+3n/an/an/an/an/an/a
CSIR
US Patent
Assay Description
The assay is based on a sandwich-ELISA protocol employing the ROCHE colorimetric reverse transcriptase kit (cat # 1468120910).
US Patent US8501767 (2013)
BindingDB Entry DOI: 10.7270/Q2Z60MPS