null
SMILES: CC[C@@H](NC(=O)c1cc(C(=O)N[C@@H](CC)c2ccccc2)n2CCCCc12)c1ccccc1
InChI Key: InChIKey=IEUZTMUZCOORCY-RPWUZVMVSA-N
Activity Spreadsheet -- Enzyme Inhibition Constant Data from BindingDB
Found 2 hits for monomerid = 218623
Trg + Lig
Ki
nM
ΔG°
kcal/mole
IC50
nM
Kd
nM
EC50/IC50
nM
koff
s-1
kon
M-1s-1
pHTemp
°C
Potassium channel subfamily K member 3
(Homo sapiens (Human))
BDBM218623
(US9284333, 16mb | US9884860, Example 16mb)
Show SMILES CC[C@@H](NC(=O)c1cc(C(=O)N[C@@H](CC)c2ccccc2)n2CCCCc12)c1ccccc1 |r|
Show InChI InChI=1S/C28H33N3O2/c1-3-23(20-13-7-5-8-14-20)29-27(32)22-19-26(31-18-12-11-17-25(22)31)28(33)30-24(4-2)21-15-9-6-10-16-21/h5-10,13-16,19,23-24H,3-4,11-12,17-18H2,1-2H3,(H,29,32)(H,30,33)/t23-,24+/m1/s1
US Patent
n/an/a 13n/an/an/an/an/a25
Sanofi
US Patent
Assay Description
Human TASK-1 channels were expressed in Xenopus oocytes. For this purpose, oocytes were isolated from Xenopus laevis and defoliculated. Subsequently,...
US Patent US9884860 (2018)
BindingDB Entry DOI: 10.7270/Q2862JGT
Potassium channel subfamily K member 3
(Homo sapiens (Human))
BDBM218623
(US9284333, 16mb | US9884860, Example 16mb)
Show SMILES CC[C@@H](NC(=O)c1cc(C(=O)N[C@@H](CC)c2ccccc2)n2CCCCc12)c1ccccc1 |r|
Show InChI InChI=1S/C28H33N3O2/c1-3-23(20-13-7-5-8-14-20)29-27(32)22-19-26(31-18-12-11-17-25(22)31)28(33)30-24(4-2)21-15-9-6-10-16-21/h5-10,13-16,19,23-24H,3-4,11-12,17-18H2,1-2H3,(H,29,32)(H,30,33)/t23-,24+/m1/s1
US Patent
n/an/a 13n/an/an/an/an/a25
Sanofi
US Patent
Assay Description
Human TASK-1 channels were expressed in Xenopus oocytes. For this purpose, oocytes were isolated from Xenopus laevis and defoliculated. Subsequently,...
US Patent US9284333 (2016)
BindingDB Entry DOI: 10.7270/Q2FJ2FMC