null
SMILES: COCCN(CCOC)C(=O)C1CCc2c(C1)sc1ncnc(Nc3cc4sc(=O)[nH]c4cc3OC)c21
InChI Key:
Activity Spreadsheet -- Enzyme Inhibition Constant Data from BindingDB
Found 1 hit for monomerid = 218771
Trg + Lig
Ki
nM
ΔG°
kcal/mole
IC50
nM
Kd
nM
EC50/IC50
nM
koff
s-1
kon
M-1s-1
pHTemp
°C
Glutathione S-transferase A1/Isoform 2 of MAP kinase-interacting serine/threonine-protein kinase 1 (MNK1a) [T344D]
(Homo sapiens (Human))
BDBM218771
(US9296757, 93)
Show SMILES COCCN(CCOC)C(=O)C1CCc2c(C1)sc1ncnc(Nc3cc4sc(=O)[nH]c4cc3OC)c21 |w:11.10|
US Patent
n/an/a 0.700n/an/an/an/a7.522
BAYER PHARMA AKTIENGESELLSCHAFT
US Patent
Assay Description
For the assay 50 nL of a 100 fold concentrated solution of the test compound in DMSO was pipetted into a black low volume 384 well microtiter plate (...
US Patent US9296757 (2016)
BindingDB Entry DOI: 10.7270/Q2XK8DD7