null
SMILES: CSCc1cc(CSC)cc(CSC)c1
InChI Key: InChIKey=PPCUFDQPSJJGLN-UHFFFAOYSA-N
Activity Spreadsheet -- Enzyme Inhibition Constant Data from BindingDB
Found 1 hit for monomerid = 218837
Trg + Lig
Ki
nM
ΔG°
kcal/mole
IC50
nM
Kd
nM
EC50/IC50
nM
koff
s-1
kon
M-1s-1
pHTemp
°C
Plasma kallikrein
(Homo sapiens (Human))
BDBM218837
(TBMB-PK15 (10))
Show SMILES CSCc1cc(CSC)cc(CSC)c1
Show InChI InChI=1S/C12H18S3/c1-13-7-10-4-11(8-14-2)6-12(5-10)9-15-3/h4-6H,7-9H2,1-3H3
1.30n/an/an/an/an/an/a7.4n/a
University of Glasgow
Assay Description
The inhibition of plasma kallikrein and coagulation factor FXII was assessed by incubating the proteases with bicyclic peptide (twofold dilutions) an...
Chembiochem 18: 387-395 (2017)
Article DOI: 10.1002/cbic.201600612
BindingDB Entry DOI: 10.7270/Q2H9942B