null
SMILES: OCc1cccc(c1)-c1cc(NC2CC2)n2ncc(\C=C3/NC(=O)NC3=O)c2n1
InChI Key: InChIKey=XDJDNFVTLAZCED-APSNUPSMSA-N
Activity Spreadsheet -- Enzyme Inhibition Constant Data from BindingDB
Found 4 hits for monomerid = 218915
Trg + Lig
Ki
nM
ΔG°
kcal/mole
IC50
nM
Kd
nM
EC50/IC50
nM
koff
s-1
kon
M-1s-1
pHTemp
°C
Casein kinase II subunit alpha/beta
(Homo sapiens (Human)-Rattus norvegicus)
BDBM218915
(US9303033, A8, Table 22A, Compound 21 | US9303033,...)
Show SMILES OCc1cccc(c1)-c1cc(NC2CC2)n2ncc(\C=C3/NC(=O)NC3=O)c2n1
Show InChI InChI=1S/C20H18N6O3/c27-10-11-2-1-3-12(6-11)15-8-17(22-14-4-5-14)26-18(23-15)13(9-21-26)7-16-19(28)25-20(29)24-16/h1-3,6-9,14,22,27H,4-5,10H2,(H2,24,25,28,29)/b16-7-
US Patent
n/an/a<10n/an/an/an/a7.2n/a
SENHWA BIOSCIENCES, INC.
US Patent
Assay Description
In a final reaction volume of 50 μl, CK2 ααββ (4 ng, 8.5 mU) was incubated with various concentrations of test compounds in ...
US Patent US9303033 (2016)
BindingDB Entry DOI: 10.7270/Q2CN72RX
Casein kinase II subunit beta
(Homo sapiens (Human))
BDBM218915
(US9303033, A8, Table 22A, Compound 21 | US9303033,...)
Show SMILES OCc1cccc(c1)-c1cc(NC2CC2)n2ncc(\C=C3/NC(=O)NC3=O)c2n1
Show InChI InChI=1S/C20H18N6O3/c27-10-11-2-1-3-12(6-11)15-8-17(22-14-4-5-14)26-18(23-15)13(9-21-26)7-16-19(28)25-20(29)24-16/h1-3,6-9,14,22,27H,4-5,10H2,(H2,24,25,28,29)/b16-7-
US Patent
n/an/a 1.25E+3n/an/an/an/a7.0n/a
SENHWA BIOSCIENCES, INC.
US Patent
Assay Description
5 uM ATP: Test compounds dissolved and diluted in DMSO (2 μl) were added to a reaction mixture comprising 10 μl of 5× Reaction Buffer (40 m...
US Patent US9303033 (2016)
BindingDB Entry DOI: 10.7270/Q2CN72RX
Casein kinase II subunit beta
(Homo sapiens (Human))
BDBM218915
(US9303033, A8, Table 22A, Compound 21 | US9303033,...)
Show SMILES OCc1cccc(c1)-c1cc(NC2CC2)n2ncc(\C=C3/NC(=O)NC3=O)c2n1
Show InChI InChI=1S/C20H18N6O3/c27-10-11-2-1-3-12(6-11)15-8-17(22-14-4-5-14)26-18(23-15)13(9-21-26)7-16-19(28)25-20(29)24-16/h1-3,6-9,14,22,27H,4-5,10H2,(H2,24,25,28,29)/b16-7-
US Patent
n/an/a 649n/an/an/an/a7.0n/a
SENHWA BIOSCIENCES, INC.
US Patent
Assay Description
5 uM ATP: Test compounds dissolved and diluted in DMSO (2 μl) were added to a reaction mixture comprising 10 μl of 5× Reaction Buffer (40 m...
US Patent US9303033 (2016)
BindingDB Entry DOI: 10.7270/Q2CN72RX
Casein kinase II subunit alpha/beta
(Homo sapiens (Human)-Rattus norvegicus)
BDBM218915
(US9303033, A8, Table 22A, Compound 21 | US9303033,...)
Show SMILES OCc1cccc(c1)-c1cc(NC2CC2)n2ncc(\C=C3/NC(=O)NC3=O)c2n1
Show InChI InChI=1S/C20H18N6O3/c27-10-11-2-1-3-12(6-11)15-8-17(22-14-4-5-14)26-18(23-15)13(9-21-26)7-16-19(28)25-20(29)24-16/h1-3,6-9,14,22,27H,4-5,10H2,(H2,24,25,28,29)/b16-7-
US Patent
n/an/a<10n/an/an/an/a7.2n/a
SENHWA BIOSCIENCES, INC.
US Patent
Assay Description
In a final reaction volume of 50 μl, CK2 ααββ (4 ng, 8.5 mU) was incubated with various concentrations of test compounds in ...
US Patent US9303033 (2016)
BindingDB Entry DOI: 10.7270/Q2CN72RX