null
SMILES: O=C1NC(=O)\C(N1)=C\c1cnn2c(NC3CC3)cc(nc12)-c1cccc(c1)C#N
InChI Key: InChIKey=ZDDJUFMUPQETHV-APSNUPSMSA-N
Activity Spreadsheet -- Enzyme Inhibition Constant Data from BindingDB
Found 4 hits for monomerid = 218923
Trg + Lig
Ki
nM
ΔG°
kcal/mole
IC50
nM
Kd
nM
EC50/IC50
nM
koff
s-1
kon
M-1s-1
pHTemp
°C
Casein kinase II subunit alpha/beta
(Homo sapiens (Human)-Rattus norvegicus)
BDBM218923
(US9303033, D4, Table 13A, Compound 12 | US9303033,...)
Show SMILES O=C1NC(=O)\C(N1)=C\c1cnn2c(NC3CC3)cc(nc12)-c1cccc(c1)C#N
Show InChI InChI=1S/C20H15N7O2/c21-9-11-2-1-3-12(6-11)15-8-17(23-14-4-5-14)27-18(24-15)13(10-22-27)7-16-19(28)26-20(29)25-16/h1-3,6-8,10,14,23H,4-5H2,(H2,25,26,28,29)/b16-7-
US Patent
n/an/a<10n/an/an/an/a7.2n/a
SENHWA BIOSCIENCES, INC.
US Patent
Assay Description
In a final reaction volume of 50 μl, CK2 ααββ (4 ng, 8.5 mU) was incubated with various concentrations of test compounds in ...
US Patent US9303033 (2016)
BindingDB Entry DOI: 10.7270/Q2CN72RX
Casein kinase II subunit beta
(Homo sapiens (Human))
BDBM218923
(US9303033, D4, Table 13A, Compound 12 | US9303033,...)
Show SMILES O=C1NC(=O)\C(N1)=C\c1cnn2c(NC3CC3)cc(nc12)-c1cccc(c1)C#N
Show InChI InChI=1S/C20H15N7O2/c21-9-11-2-1-3-12(6-11)15-8-17(23-14-4-5-14)27-18(24-15)13(10-22-27)7-16-19(28)26-20(29)25-16/h1-3,6-8,10,14,23H,4-5H2,(H2,25,26,28,29)/b16-7-
US Patent
n/an/a 75.4n/an/an/an/a7.0n/a
SENHWA BIOSCIENCES, INC.
US Patent
Assay Description
5 uM ATP: Test compounds dissolved and diluted in DMSO (2 μl) were added to a reaction mixture comprising 10 μl of 5× Reaction Buffer (40 m...
US Patent US9303033 (2016)
BindingDB Entry DOI: 10.7270/Q2CN72RX
Casein kinase II subunit beta
(Homo sapiens (Human))
BDBM218923
(US9303033, D4, Table 13A, Compound 12 | US9303033,...)
Show SMILES O=C1NC(=O)\C(N1)=C\c1cnn2c(NC3CC3)cc(nc12)-c1cccc(c1)C#N
Show InChI InChI=1S/C20H15N7O2/c21-9-11-2-1-3-12(6-11)15-8-17(23-14-4-5-14)27-18(24-15)13(10-22-27)7-16-19(28)26-20(29)25-16/h1-3,6-8,10,14,23H,4-5H2,(H2,25,26,28,29)/b16-7-
US Patent
n/an/a>2.50E+3n/an/an/an/a7.0n/a
SENHWA BIOSCIENCES, INC.
US Patent
Assay Description
5 uM ATP: Test compounds dissolved and diluted in DMSO (2 μl) were added to a reaction mixture comprising 10 μl of 5× Reaction Buffer (40 m...
US Patent US9303033 (2016)
BindingDB Entry DOI: 10.7270/Q2CN72RX
Casein kinase II subunit alpha/beta
(Homo sapiens (Human)-Rattus norvegicus)
BDBM218923
(US9303033, D4, Table 13A, Compound 12 | US9303033,...)
Show SMILES O=C1NC(=O)\C(N1)=C\c1cnn2c(NC3CC3)cc(nc12)-c1cccc(c1)C#N
Show InChI InChI=1S/C20H15N7O2/c21-9-11-2-1-3-12(6-11)15-8-17(23-14-4-5-14)27-18(24-15)13(10-22-27)7-16-19(28)26-20(29)25-16/h1-3,6-8,10,14,23H,4-5H2,(H2,25,26,28,29)/b16-7-
US Patent
n/an/a<10n/an/an/an/a7.2n/a
SENHWA BIOSCIENCES, INC.
US Patent
Assay Description
In a final reaction volume of 50 μl, CK2 ααββ (4 ng, 8.5 mU) was incubated with various concentrations of test compounds in ...
US Patent US9303033 (2016)
BindingDB Entry DOI: 10.7270/Q2CN72RX