null
SMILES: Clc1cccc(c1)-c1cc(S(=O)Cc2ccccc2)n2ncc(\C=C3/NC(=O)NC3=O)c2n1
InChI Key: InChIKey=VQIJPCMGEFWSFF-GRSHGNNSSA-N
Activity Spreadsheet -- Enzyme Inhibition Constant Data from BindingDB
Found 2 hits for monomerid = 218973
Trg + Lig
Ki
nM
ΔG°
kcal/mole
IC50
nM
Kd
nM
EC50/IC50
nM
koff
s-1
kon
M-1s-1
pHTemp
°C
Casein kinase II subunit beta
(Homo sapiens (Human))
BDBM218973
(US9303033, A6, Table 18A, Compound 4)
Show SMILES Clc1cccc(c1)-c1cc(S(=O)Cc2ccccc2)n2ncc(\C=C3/NC(=O)NC3=O)c2n1
Show InChI InChI=1S/C23H16ClN5O3S/c24-17-8-4-7-15(9-17)18-11-20(33(32)13-14-5-2-1-3-6-14)29-21(26-18)16(12-25-29)10-19-22(30)28-23(31)27-19/h1-12H,13H2,(H2,27,28,30,31)/b19-10-
US Patent
n/an/a 209n/an/an/an/a7.0n/a
SENHWA BIOSCIENCES, INC.
US Patent
Assay Description
5 uM ATP: Test compounds dissolved and diluted in DMSO (2 μl) were added to a reaction mixture comprising 10 μl of 5× Reaction Buffer (40 m...
US Patent US9303033 (2016)
BindingDB Entry DOI: 10.7270/Q2CN72RX
Casein kinase II subunit alpha/beta
(Homo sapiens (Human)-Rattus norvegicus)
BDBM218973
(US9303033, A6, Table 18A, Compound 4)
Show SMILES Clc1cccc(c1)-c1cc(S(=O)Cc2ccccc2)n2ncc(\C=C3/NC(=O)NC3=O)c2n1
Show InChI InChI=1S/C23H16ClN5O3S/c24-17-8-4-7-15(9-17)18-11-20(33(32)13-14-5-2-1-3-6-14)29-21(26-18)16(12-25-29)10-19-22(30)28-23(31)27-19/h1-12H,13H2,(H2,27,28,30,31)/b19-10-
US Patent
n/an/a<100n/an/an/an/a7.2n/a
SENHWA BIOSCIENCES, INC.
US Patent
Assay Description
In a final reaction volume of 50 μl, CK2 ααββ (4 ng, 8.5 mU) was incubated with various concentrations of test compounds in ...
US Patent US9303033 (2016)
BindingDB Entry DOI: 10.7270/Q2CN72RX