BDBM21913 8-bromo-4-[(3-chloro-4-fluorophenyl)amino]-6-{[(1-phenyl-1H-pyrazol-5-yl)methyl]amino}quinoline-3-carbonitrile::Cyanoquinoline, 26
SMILES: Fc1ccc(Nc2c(cnc3c(Br)cc(NCc4ccnn4-c4ccccc4)cc23)C#N)cc1Cl
InChI Key: InChIKey=UWKYOOXSHMIYSX-UHFFFAOYSA-N
Data: 1 IC50
Activity Spreadsheet -- Enzyme Inhibition Constant Data from BindingDB
Found 1 hit for monomerid = 21913
Trg + Lig
Ki
nM
ΔG°
kcal/mole
IC50
nM
Kd
nM
EC50/IC50
nM
koff
s-1
kon
M-1s-1
pHTemp
°C
Mitogen-activated protein kinase kinase kinase 8
(Homo sapiens (Human))
BDBM21913
(8-bromo-4-[(3-chloro-4-fluorophenyl)amino]-6-{[(1-...)
Show SMILES Fc1ccc(Nc2c(cnc3c(Br)cc(NCc4ccnn4-c4ccccc4)cc23)C#N)cc1Cl
Show InChI InChI=1S/C26H17BrClFN6/c27-22-11-18(31-15-20-8-9-33-35(20)19-4-2-1-3-5-19)10-21-25(16(13-30)14-32-26(21)22)34-17-6-7-24(29)23(28)12-17/h1-12,14,31H,15H2,(H,32,34)
NCI pathway
Reactome pathway
n/an/a 250n/an/an/an/a7.230
Wyeth Research
Assay Description
Tpl2/Cot activity was directly assayed using GST-MEK1 as a substrate. The phosphorylation on serine residues was detected by an ELISA. IC50 calculati...
J Med Chem 50: 4728-45 (2007)
Article DOI: 10.1021/jm070436q
BindingDB Entry DOI: 10.7270/Q2891441