BDBM21915 8-chloro-4-[(3-chloro-4-fluorophenyl)amino]-6-[(pyridin-3-ylmethyl)amino]quinoline-3-carbonitrile::Cyanoquinoline, 28
SMILES: Fc1ccc(Nc2c(cnc3c(Cl)cc(NCc4cccnc4)cc23)C#N)cc1Cl
InChI Key: InChIKey=VERMEYXVPILBCD-UHFFFAOYSA-N
Data: 2 IC50
Activity Spreadsheet -- Enzyme Inhibition Constant Data from BindingDB
Found 2 hits for monomerid = 21915
Trg + Lig
Ki
nM
ΔG°
kcal/mole
IC50
nM
Kd
nM
EC50/IC50
nM
koff
s-1
kon
M-1s-1
pHTemp
°C
Epidermal growth factor receptor
(Homo sapiens (Human))
BDBM21915
(8-chloro-4-[(3-chloro-4-fluorophenyl)amino]-6-[(py...)
Show SMILES Fc1ccc(Nc2c(cnc3c(Cl)cc(NCc4cccnc4)cc23)C#N)cc1Cl
Show InChI InChI=1S/C22H14Cl2FN5/c23-18-7-15(3-4-20(18)25)30-21-14(9-26)12-29-22-17(21)6-16(8-19(22)24)28-11-13-2-1-5-27-10-13/h1-8,10,12,28H,11H2,(H,29,30)
n/an/a>5.00E+3n/an/an/an/an/an/a
Wyeth Research
Assay Description
EGFR kinase activity was assayed using poly(Glu4-Tyr) as a substrate. The phosphorylation of tyrosine residue was detected by an ELISA. IC50 calculat...
J Med Chem 50: 4728-45 (2007)
Article DOI: 10.1021/jm070436q
BindingDB Entry DOI: 10.7270/Q2891441
Mitogen-activated protein kinase kinase kinase 8
(Homo sapiens (Human))
BDBM21915
(8-chloro-4-[(3-chloro-4-fluorophenyl)amino]-6-[(py...)
Show SMILES Fc1ccc(Nc2c(cnc3c(Cl)cc(NCc4cccnc4)cc23)C#N)cc1Cl
Show InChI InChI=1S/C22H14Cl2FN5/c23-18-7-15(3-4-20(18)25)30-21-14(9-26)12-29-22-17(21)6-16(8-19(22)24)28-11-13-2-1-5-27-10-13/h1-8,10,12,28H,11H2,(H,29,30)
NCI pathway
Reactome pathway
n/an/a 16n/an/an/an/a7.230
Wyeth Research
Assay Description
Tpl2/Cot activity was directly assayed using GST-MEK1 as a substrate. The phosphorylation on serine residues was detected by an ELISA. IC50 calculati...
J Med Chem 50: 4728-45 (2007)
Article DOI: 10.1021/jm070436q
BindingDB Entry DOI: 10.7270/Q2891441